SuccessConsole Output

Skipping 444 KB.. Full Log
af(ParentRunner.java:325)
	at org.junit.runners.BlockJUnit4ClassRunner.runChild(BlockJUnit4ClassRunner.java:78)
	at org.junit.runners.BlockJUnit4ClassRunner.runChild(BlockJUnit4ClassRunner.java:57)
	at org.junit.runners.ParentRunner$3.run(ParentRunner.java:290)
	at org.junit.runners.ParentRunner$1.schedule(ParentRunner.java:71)
	at org.junit.runners.ParentRunner.runChildren(ParentRunner.java:288)
	at org.junit.runners.ParentRunner.access$000(ParentRunner.java:58)
	at org.junit.runners.ParentRunner$2.evaluate(ParentRunner.java:268)
	at org.junit.runners.ParentRunner.run(ParentRunner.java:363)
	at org.apache.maven.surefire.junit4.JUnit4Provider.execute(JUnit4Provider.java:367)
	at org.apache.maven.surefire.junit4.JUnit4Provider.executeWithRerun(JUnit4Provider.java:274)
	at org.apache.maven.surefire.junit4.JUnit4Provider.executeTestSet(JUnit4Provider.java:238)
	at org.apache.maven.surefire.junit4.JUnit4Provider.invoke(JUnit4Provider.java:161)
	at org.apache.maven.surefire.booter.ForkedBooter.invokeProviderInSameClassLoader(ForkedBooter.java:290)
	at org.apache.maven.surefire.booter.ForkedBooter.runSuitesInProcess(ForkedBooter.java:242)
	at org.apache.maven.surefire.booter.ForkedBooter.main(ForkedBooter.java:121)
19:17:22.556 [main] DEBUG net.anotheria.anoplass.api.generic.observation.ObservationAPIImpl - Firing update event for user 28, originator: 28 and subject: TEST
19:17:22.556 [main] DEBUG net.anotheria.anoplass.api.generic.observation.ObservationAPIImpl - Firing update event for current user, originator: 29 and subject: TEST
19:17:22.556 [main] WARN net.anotheria.anoplass.api.generic.observation.ObservationAPIImpl - (Uncaught exception in observer: net.anotheria.anoplass.api.generic.observation.ObservationAPITest$2@290d210d .notifySubjectUpdatedForCurrentUser(S: TEST, O: 29, U: current, T: 1523467042556, D: Wed. 11.04.2018, 19:17)
java.lang.RuntimeException: foo
	at net.anotheria.anoplass.api.generic.observation.ObservationAPITest$2.notifySubjectUpdatedForCurrentUser(ObservationAPITest.java:71)
	at net.anotheria.anoplass.api.generic.observation.ObservationAPIImpl.fireSubjectUpdateForCurrentUser(ObservationAPIImpl.java:52)
	at sun.reflect.GeneratedMethodAccessor4.invoke(Unknown Source)
	at sun.reflect.DelegatingMethodAccessorImpl.invoke(DelegatingMethodAccessorImpl.java:43)
	at java.lang.reflect.Method.invoke(Method.java:498)
	at net.anotheria.moskito.core.predefined.ServiceStatsCallHandler.invoke(ServiceStatsCallHandler.java:102)
	at net.anotheria.moskito.core.dynamic.MoskitoInvokationProxy.invoke(MoskitoInvokationProxy.java:183)
	at com.sun.proxy.$Proxy16.fireSubjectUpdateForCurrentUser(Unknown Source)
	at sun.reflect.GeneratedMethodAccessor4.invoke(Unknown Source)
	at sun.reflect.DelegatingMethodAccessorImpl.invoke(DelegatingMethodAccessorImpl.java:43)
	at java.lang.reflect.Method.invoke(Method.java:498)
	at net.anotheria.anoplass.api.APICallHandler.invoke(APICallHandler.java:92)
	at com.sun.proxy.$Proxy16.fireSubjectUpdateForCurrentUser(Unknown Source)
	at net.anotheria.anoplass.api.generic.observation.ObservationAPITest.testErrorInObserver(ObservationAPITest.java:78)
	at sun.reflect.NativeMethodAccessorImpl.invoke0(Native Method)
	at sun.reflect.NativeMethodAccessorImpl.invoke(NativeMethodAccessorImpl.java:62)
	at sun.reflect.DelegatingMethodAccessorImpl.invoke(DelegatingMethodAccessorImpl.java:43)
	at java.lang.reflect.Method.invoke(Method.java:498)
	at org.junit.runners.model.FrameworkMethod$1.runReflectiveCall(FrameworkMethod.java:50)
	at org.junit.internal.runners.model.ReflectiveCallable.run(ReflectiveCallable.java:12)
	at org.junit.runners.model.FrameworkMethod.invokeExplosively(FrameworkMethod.java:47)
	at org.junit.internal.runners.statements.InvokeMethod.evaluate(InvokeMethod.java:17)
	at org.junit.internal.runners.statements.RunBefores.evaluate(RunBefores.java:26)
	at org.junit.runners.ParentRunner.runLeaf(ParentRunner.java:325)
	at org.junit.runners.BlockJUnit4ClassRunner.runChild(BlockJUnit4ClassRunner.java:78)
	at org.junit.runners.BlockJUnit4ClassRunner.runChild(BlockJUnit4ClassRunner.java:57)
	at org.junit.runners.ParentRunner$3.run(ParentRunner.java:290)
	at org.junit.runners.ParentRunner$1.schedule(ParentRunner.java:71)
	at org.junit.runners.ParentRunner.runChildren(ParentRunner.java:288)
	at org.junit.runners.ParentRunner.access$000(ParentRunner.java:58)
	at org.junit.runners.ParentRunner$2.evaluate(ParentRunner.java:268)
	at org.junit.runners.ParentRunner.run(ParentRunner.java:363)
	at org.apache.maven.surefire.junit4.JUnit4Provider.execute(JUnit4Provider.java:367)
	at org.apache.maven.surefire.junit4.JUnit4Provider.executeWithRerun(JUnit4Provider.java:274)
	at org.apache.maven.surefire.junit4.JUnit4Provider.executeTestSet(JUnit4Provider.java:238)
	at org.apache.maven.surefire.junit4.JUnit4Provider.invoke(JUnit4Provider.java:161)
	at org.apache.maven.surefire.booter.ForkedBooter.invokeProviderInSameClassLoader(ForkedBooter.java:290)
	at org.apache.maven.surefire.booter.ForkedBooter.runSuitesInProcess(ForkedBooter.java:242)
	at org.apache.maven.surefire.booter.ForkedBooter.main(ForkedBooter.java:121)
19:17:22.556 [main] DEBUG net.anotheria.anoplass.api.generic.observation.ObservationAPIImpl - Firing update event for user 30, originator: 30 and subject: TEST
19:17:22.556 [main] DEBUG net.anotheria.anoplass.api.generic.observation.ObservationAPIImpl - Firing update event for current user, originator: 31 and subject: TEST
19:17:22.556 [main] WARN net.anotheria.anoplass.api.generic.observation.ObservationAPIImpl - (Uncaught exception in observer: net.anotheria.anoplass.api.generic.observation.ObservationAPITest$2@290d210d .notifySubjectUpdatedForCurrentUser(S: TEST, O: 31, U: current, T: 1523467042556, D: Wed. 11.04.2018, 19:17)
java.lang.RuntimeException: foo
	at net.anotheria.anoplass.api.generic.observation.ObservationAPITest$2.notifySubjectUpdatedForCurrentUser(ObservationAPITest.java:71)
	at net.anotheria.anoplass.api.generic.observation.ObservationAPIImpl.fireSubjectUpdateForCurrentUser(ObservationAPIImpl.java:52)
	at sun.reflect.GeneratedMethodAccessor4.invoke(Unknown Source)
	at sun.reflect.DelegatingMethodAccessorImpl.invoke(DelegatingMethodAccessorImpl.java:43)
	at java.lang.reflect.Method.invoke(Method.java:498)
	at net.anotheria.moskito.core.predefined.ServiceStatsCallHandler.invoke(ServiceStatsCallHandler.java:102)
	at net.anotheria.moskito.core.dynamic.MoskitoInvokationProxy.invoke(MoskitoInvokationProxy.java:183)
	at com.sun.proxy.$Proxy16.fireSubjectUpdateForCurrentUser(Unknown Source)
	at sun.reflect.GeneratedMethodAccessor4.invoke(Unknown Source)
	at sun.reflect.DelegatingMethodAccessorImpl.invoke(DelegatingMethodAccessorImpl.java:43)
	at java.lang.reflect.Method.invoke(Method.java:498)
	at net.anotheria.anoplass.api.APICallHandler.invoke(APICallHandler.java:92)
	at com.sun.proxy.$Proxy16.fireSubjectUpdateForCurrentUser(Unknown Source)
	at net.anotheria.anoplass.api.generic.observation.ObservationAPITest.testErrorInObserver(ObservationAPITest.java:78)
	at sun.reflect.NativeMethodAccessorImpl.invoke0(Native Method)
	at sun.reflect.NativeMethodAccessorImpl.invoke(NativeMethodAccessorImpl.java:62)
	at sun.reflect.DelegatingMethodAccessorImpl.invoke(DelegatingMethodAccessorImpl.java:43)
	at java.lang.reflect.Method.invoke(Method.java:498)
	at org.junit.runners.model.FrameworkMethod$1.runReflectiveCall(FrameworkMethod.java:50)
	at org.junit.internal.runners.model.ReflectiveCallable.run(ReflectiveCallable.java:12)
	at org.junit.runners.model.FrameworkMethod.invokeExplosively(FrameworkMethod.java:47)
	at org.junit.internal.runners.statements.InvokeMethod.evaluate(InvokeMethod.java:17)
	at org.junit.internal.runners.statements.RunBefores.evaluate(RunBefores.java:26)
	at org.junit.runners.ParentRunner.runLeaf(ParentRunner.java:325)
	at org.junit.runners.BlockJUnit4ClassRunner.runChild(BlockJUnit4ClassRunner.java:78)
	at org.junit.runners.BlockJUnit4ClassRunner.runChild(BlockJUnit4ClassRunner.java:57)
	at org.junit.runners.ParentRunner$3.run(ParentRunner.java:290)
	at org.junit.runners.ParentRunner$1.schedule(ParentRunner.java:71)
	at org.junit.runners.ParentRunner.runChildren(ParentRunner.java:288)
	at org.junit.runners.ParentRunner.access$000(ParentRunner.java:58)
	at org.junit.runners.ParentRunner$2.evaluate(ParentRunner.java:268)
	at org.junit.runners.ParentRunner.run(ParentRunner.java:363)
	at org.apache.maven.surefire.junit4.JUnit4Provider.execute(JUnit4Provider.java:367)
	at org.apache.maven.surefire.junit4.JUnit4Provider.executeWithRerun(JUnit4Provider.java:274)
	at org.apache.maven.surefire.junit4.JUnit4Provider.executeTestSet(JUnit4Provider.java:238)
	at org.apache.maven.surefire.junit4.JUnit4Provider.invoke(JUnit4Provider.java:161)
	at org.apache.maven.surefire.booter.ForkedBooter.invokeProviderInSameClassLoader(ForkedBooter.java:290)
	at org.apache.maven.surefire.booter.ForkedBooter.runSuitesInProcess(ForkedBooter.java:242)
	at org.apache.maven.surefire.booter.ForkedBooter.main(ForkedBooter.java:121)
19:17:22.556 [main] DEBUG net.anotheria.anoplass.api.generic.observation.ObservationAPIImpl - Firing update event for user 32, originator: 32 and subject: TEST
19:17:22.557 [main] DEBUG net.anotheria.anoplass.api.generic.observation.ObservationAPIImpl - Firing update event for current user, originator: 33 and subject: TEST
19:17:22.557 [main] WARN net.anotheria.anoplass.api.generic.observation.ObservationAPIImpl - (Uncaught exception in observer: net.anotheria.anoplass.api.generic.observation.ObservationAPITest$2@290d210d .notifySubjectUpdatedForCurrentUser(S: TEST, O: 33, U: current, T: 1523467042557, D: Wed. 11.04.2018, 19:17)
java.lang.RuntimeException: foo
	at net.anotheria.anoplass.api.generic.observation.ObservationAPITest$2.notifySubjectUpdatedForCurrentUser(ObservationAPITest.java:71)
	at net.anotheria.anoplass.api.generic.observation.ObservationAPIImpl.fireSubjectUpdateForCurrentUser(ObservationAPIImpl.java:52)
	at sun.reflect.GeneratedMethodAccessor4.invoke(Unknown Source)
	at sun.reflect.DelegatingMethodAccessorImpl.invoke(DelegatingMethodAccessorImpl.java:43)
	at java.lang.reflect.Method.invoke(Method.java:498)
	at net.anotheria.moskito.core.predefined.ServiceStatsCallHandler.invoke(ServiceStatsCallHandler.java:102)
	at net.anotheria.moskito.core.dynamic.MoskitoInvokationProxy.invoke(MoskitoInvokationProxy.java:183)
	at com.sun.proxy.$Proxy16.fireSubjectUpdateForCurrentUser(Unknown Source)
	at sun.reflect.GeneratedMethodAccessor4.invoke(Unknown Source)
	at sun.reflect.DelegatingMethodAccessorImpl.invoke(DelegatingMethodAccessorImpl.java:43)
	at java.lang.reflect.Method.invoke(Method.java:498)
	at net.anotheria.anoplass.api.APICallHandler.invoke(APICallHandler.java:92)
	at com.sun.proxy.$Proxy16.fireSubjectUpdateForCurrentUser(Unknown Source)
	at net.anotheria.anoplass.api.generic.observation.ObservationAPITest.testErrorInObserver(ObservationAPITest.java:78)
	at sun.reflect.NativeMethodAccessorImpl.invoke0(Native Method)
	at sun.reflect.NativeMethodAccessorImpl.invoke(NativeMethodAccessorImpl.java:62)
	at sun.reflect.DelegatingMethodAccessorImpl.invoke(DelegatingMethodAccessorImpl.java:43)
	at java.lang.reflect.Method.invoke(Method.java:498)
	at org.junit.runners.model.FrameworkMethod$1.runReflectiveCall(FrameworkMethod.java:50)
	at org.junit.internal.runners.model.ReflectiveCallable.run(ReflectiveCallable.java:12)
	at org.junit.runners.model.FrameworkMethod.invokeExplosively(FrameworkMethod.java:47)
	at org.junit.internal.runners.statements.InvokeMethod.evaluate(InvokeMethod.java:17)
	at org.junit.internal.runners.statements.RunBefores.evaluate(RunBefores.java:26)
	at org.junit.runners.ParentRunner.runLeaf(ParentRunner.java:325)
	at org.junit.runners.BlockJUnit4ClassRunner.runChild(BlockJUnit4ClassRunner.java:78)
	at org.junit.runners.BlockJUnit4ClassRunner.runChild(BlockJUnit4ClassRunner.java:57)
	at org.junit.runners.ParentRunner$3.run(ParentRunner.java:290)
	at org.junit.runners.ParentRunner$1.schedule(ParentRunner.java:71)
	at org.junit.runners.ParentRunner.runChildren(ParentRunner.java:288)
	at org.junit.runners.ParentRunner.access$000(ParentRunner.java:58)
	at org.junit.runners.ParentRunner$2.evaluate(ParentRunner.java:268)
	at org.junit.runners.ParentRunner.run(ParentRunner.java:363)
	at org.apache.maven.surefire.junit4.JUnit4Provider.execute(JUnit4Provider.java:367)
	at org.apache.maven.surefire.junit4.JUnit4Provider.executeWithRerun(JUnit4Provider.java:274)
	at org.apache.maven.surefire.junit4.JUnit4Provider.executeTestSet(JUnit4Provider.java:238)
	at org.apache.maven.surefire.junit4.JUnit4Provider.invoke(JUnit4Provider.java:161)
	at org.apache.maven.surefire.booter.ForkedBooter.invokeProviderInSameClassLoader(ForkedBooter.java:290)
	at org.apache.maven.surefire.booter.ForkedBooter.runSuitesInProcess(ForkedBooter.java:242)
	at org.apache.maven.surefire.booter.ForkedBooter.main(ForkedBooter.java:121)
19:17:22.557 [main] DEBUG net.anotheria.anoplass.api.generic.observation.ObservationAPIImpl - Firing update event for user 34, originator: 34 and subject: TEST
19:17:22.557 [main] DEBUG net.anotheria.anoplass.api.generic.observation.ObservationAPIImpl - Firing update event for current user, originator: 35 and subject: TEST
19:17:22.557 [main] WARN net.anotheria.anoplass.api.generic.observation.ObservationAPIImpl - (Uncaught exception in observer: net.anotheria.anoplass.api.generic.observation.ObservationAPITest$2@290d210d .notifySubjectUpdatedForCurrentUser(S: TEST, O: 35, U: current, T: 1523467042557, D: Wed. 11.04.2018, 19:17)
java.lang.RuntimeException: foo
	at net.anotheria.anoplass.api.generic.observation.ObservationAPITest$2.notifySubjectUpdatedForCurrentUser(ObservationAPITest.java:71)
	at net.anotheria.anoplass.api.generic.observation.ObservationAPIImpl.fireSubjectUpdateForCurrentUser(ObservationAPIImpl.java:52)
	at sun.reflect.GeneratedMethodAccessor4.invoke(Unknown Source)
	at sun.reflect.DelegatingMethodAccessorImpl.invoke(DelegatingMethodAccessorImpl.java:43)
	at java.lang.reflect.Method.invoke(Method.java:498)
	at net.anotheria.moskito.core.predefined.ServiceStatsCallHandler.invoke(ServiceStatsCallHandler.java:102)
	at net.anotheria.moskito.core.dynamic.MoskitoInvokationProxy.invoke(MoskitoInvokationProxy.java:183)
	at com.sun.proxy.$Proxy16.fireSubjectUpdateForCurrentUser(Unknown Source)
	at sun.reflect.GeneratedMethodAccessor4.invoke(Unknown Source)
	at sun.reflect.DelegatingMethodAccessorImpl.invoke(DelegatingMethodAccessorImpl.java:43)
	at java.lang.reflect.Method.invoke(Method.java:498)
	at net.anotheria.anoplass.api.APICallHandler.invoke(APICallHandler.java:92)
	at com.sun.proxy.$Proxy16.fireSubjectUpdateForCurrentUser(Unknown Source)
	at net.anotheria.anoplass.api.generic.observation.ObservationAPITest.testErrorInObserver(ObservationAPITest.java:78)
	at sun.reflect.NativeMethodAccessorImpl.invoke0(Native Method)
	at sun.reflect.NativeMethodAccessorImpl.invoke(NativeMethodAccessorImpl.java:62)
	at sun.reflect.DelegatingMethodAccessorImpl.invoke(DelegatingMethodAccessorImpl.java:43)
	at java.lang.reflect.Method.invoke(Method.java:498)
	at org.junit.runners.model.FrameworkMethod$1.runReflectiveCall(FrameworkMethod.java:50)
	at org.junit.internal.runners.model.ReflectiveCallable.run(ReflectiveCallable.java:12)
	at org.junit.runners.model.FrameworkMethod.invokeExplosively(FrameworkMethod.java:47)
	at org.junit.internal.runners.statements.InvokeMethod.evaluate(InvokeMethod.java:17)
	at org.junit.internal.runners.statements.RunBefores.evaluate(RunBefores.java:26)
	at org.junit.runners.ParentRunner.runLeaf(ParentRunner.java:325)
	at org.junit.runners.BlockJUnit4ClassRunner.runChild(BlockJUnit4ClassRunner.java:78)
	at org.junit.runners.BlockJUnit4ClassRunner.runChild(BlockJUnit4ClassRunner.java:57)
	at org.junit.runners.ParentRunner$3.run(ParentRunner.java:290)
	at org.junit.runners.ParentRunner$1.schedule(ParentRunner.java:71)
	at org.junit.runners.ParentRunner.runChildren(ParentRunner.java:288)
	at org.junit.runners.ParentRunner.access$000(ParentRunner.java:58)
	at org.junit.runners.ParentRunner$2.evaluate(ParentRunner.java:268)
	at org.junit.runners.ParentRunner.run(ParentRunner.java:363)
	at org.apache.maven.surefire.junit4.JUnit4Provider.execute(JUnit4Provider.java:367)
	at org.apache.maven.surefire.junit4.JUnit4Provider.executeWithRerun(JUnit4Provider.java:274)
	at org.apache.maven.surefire.junit4.JUnit4Provider.executeTestSet(JUnit4Provider.java:238)
	at org.apache.maven.surefire.junit4.JUnit4Provider.invoke(JUnit4Provider.java:161)
	at org.apache.maven.surefire.booter.ForkedBooter.invokeProviderInSameClassLoader(ForkedBooter.java:290)
	at org.apache.maven.surefire.booter.ForkedBooter.runSuitesInProcess(ForkedBooter.java:242)
	at org.apache.maven.surefire.booter.ForkedBooter.main(ForkedBooter.java:121)
19:17:22.557 [main] DEBUG net.anotheria.anoplass.api.generic.observation.ObservationAPIImpl - Firing update event for user 36, originator: 36 and subject: TEST
19:17:22.558 [main] DEBUG net.anotheria.anoplass.api.generic.observation.ObservationAPIImpl - Firing update event for current user, originator: 37 and subject: TEST
19:17:22.558 [main] WARN net.anotheria.anoplass.api.generic.observation.ObservationAPIImpl - (Uncaught exception in observer: net.anotheria.anoplass.api.generic.observation.ObservationAPITest$2@290d210d .notifySubjectUpdatedForCurrentUser(S: TEST, O: 37, U: current, T: 1523467042558, D: Wed. 11.04.2018, 19:17)
java.lang.RuntimeException: foo
	at net.anotheria.anoplass.api.generic.observation.ObservationAPITest$2.notifySubjectUpdatedForCurrentUser(ObservationAPITest.java:71)
	at net.anotheria.anoplass.api.generic.observation.ObservationAPIImpl.fireSubjectUpdateForCurrentUser(ObservationAPIImpl.java:52)
	at sun.reflect.GeneratedMethodAccessor4.invoke(Unknown Source)
	at sun.reflect.DelegatingMethodAccessorImpl.invoke(DelegatingMethodAccessorImpl.java:43)
	at java.lang.reflect.Method.invoke(Method.java:498)
	at net.anotheria.moskito.core.predefined.ServiceStatsCallHandler.invoke(ServiceStatsCallHandler.java:102)
	at net.anotheria.moskito.core.dynamic.MoskitoInvokationProxy.invoke(MoskitoInvokationProxy.java:183)
	at com.sun.proxy.$Proxy16.fireSubjectUpdateForCurrentUser(Unknown Source)
	at sun.reflect.GeneratedMethodAccessor4.invoke(Unknown Source)
	at sun.reflect.DelegatingMethodAccessorImpl.invoke(DelegatingMethodAccessorImpl.java:43)
	at java.lang.reflect.Method.invoke(Method.java:498)
	at net.anotheria.anoplass.api.APICallHandler.invoke(APICallHandler.java:92)
	at com.sun.proxy.$Proxy16.fireSubjectUpdateForCurrentUser(Unknown Source)
	at net.anotheria.anoplass.api.generic.observation.ObservationAPITest.testErrorInObserver(ObservationAPITest.java:78)
	at sun.reflect.NativeMethodAccessorImpl.invoke0(Native Method)
	at sun.reflect.NativeMethodAccessorImpl.invoke(NativeMethodAccessorImpl.java:62)
	at sun.reflect.DelegatingMethodAccessorImpl.invoke(DelegatingMethodAccessorImpl.java:43)
	at java.lang.reflect.Method.invoke(Method.java:498)
	at org.junit.runners.model.FrameworkMethod$1.runReflectiveCall(FrameworkMethod.java:50)
	at org.junit.internal.runners.model.ReflectiveCallable.run(ReflectiveCallable.java:12)
	at org.junit.runners.model.FrameworkMethod.invokeExplosively(FrameworkMethod.java:47)
	at org.junit.internal.runners.statements.InvokeMethod.evaluate(InvokeMethod.java:17)
	at org.junit.internal.runners.statements.RunBefores.evaluate(RunBefores.java:26)
	at org.junit.runners.ParentRunner.runLeaf(ParentRunner.java:325)
	at org.junit.runners.BlockJUnit4ClassRunner.runChild(BlockJUnit4ClassRunner.java:78)
	at org.junit.runners.BlockJUnit4ClassRunner.runChild(BlockJUnit4ClassRunner.java:57)
	at org.junit.runners.ParentRunner$3.run(ParentRunner.java:290)
	at org.junit.runners.ParentRunner$1.schedule(ParentRunner.java:71)
	at org.junit.runners.ParentRunner.runChildren(ParentRunner.java:288)
	at org.junit.runners.ParentRunner.access$000(ParentRunner.java:58)
	at org.junit.runners.ParentRunner$2.evaluate(ParentRunner.java:268)
	at org.junit.runners.ParentRunner.run(ParentRunner.java:363)
	at org.apache.maven.surefire.junit4.JUnit4Provider.execute(JUnit4Provider.java:367)
	at org.apache.maven.surefire.junit4.JUnit4Provider.executeWithRerun(JUnit4Provider.java:274)
	at org.apache.maven.surefire.junit4.JUnit4Provider.executeTestSet(JUnit4Provider.java:238)
	at org.apache.maven.surefire.junit4.JUnit4Provider.invoke(JUnit4Provider.java:161)
	at org.apache.maven.surefire.booter.ForkedBooter.invokeProviderInSameClassLoader(ForkedBooter.java:290)
	at org.apache.maven.surefire.booter.ForkedBooter.runSuitesInProcess(ForkedBooter.java:242)
	at org.apache.maven.surefire.booter.ForkedBooter.main(ForkedBooter.java:121)
19:17:22.558 [main] DEBUG net.anotheria.anoplass.api.generic.observation.ObservationAPIImpl - Firing update event for user 38, originator: 38 and subject: TEST
19:17:22.558 [main] DEBUG net.anotheria.anoplass.api.generic.observation.ObservationAPIImpl - Firing update event for current user, originator: 39 and subject: TEST
19:17:22.558 [main] WARN net.anotheria.anoplass.api.generic.observation.ObservationAPIImpl - (Uncaught exception in observer: net.anotheria.anoplass.api.generic.observation.ObservationAPITest$2@290d210d .notifySubjectUpdatedForCurrentUser(S: TEST, O: 39, U: current, T: 1523467042558, D: Wed. 11.04.2018, 19:17)
java.lang.RuntimeException: foo
	at net.anotheria.anoplass.api.generic.observation.ObservationAPITest$2.notifySubjectUpdatedForCurrentUser(ObservationAPITest.java:71)
	at net.anotheria.anoplass.api.generic.observation.ObservationAPIImpl.fireSubjectUpdateForCurrentUser(ObservationAPIImpl.java:52)
	at sun.reflect.GeneratedMethodAccessor4.invoke(Unknown Source)
	at sun.reflect.DelegatingMethodAccessorImpl.invoke(DelegatingMethodAccessorImpl.java:43)
	at java.lang.reflect.Method.invoke(Method.java:498)
	at net.anotheria.moskito.core.predefined.ServiceStatsCallHandler.invoke(ServiceStatsCallHandler.java:102)
	at net.anotheria.moskito.core.dynamic.MoskitoInvokationProxy.invoke(MoskitoInvokationProxy.java:183)
	at com.sun.proxy.$Proxy16.fireSubjectUpdateForCurrentUser(Unknown Source)
	at sun.reflect.GeneratedMethodAccessor4.invoke(Unknown Source)
	at sun.reflect.DelegatingMethodAccessorImpl.invoke(DelegatingMethodAccessorImpl.java:43)
	at java.lang.reflect.Method.invoke(Method.java:498)
	at net.anotheria.anoplass.api.APICallHandler.invoke(APICallHandler.java:92)
	at com.sun.proxy.$Proxy16.fireSubjectUpdateForCurrentUser(Unknown Source)
	at net.anotheria.anoplass.api.generic.observation.ObservationAPITest.testErrorInObserver(ObservationAPITest.java:78)
	at sun.reflect.NativeMethodAccessorImpl.invoke0(Native Method)
	at sun.reflect.NativeMethodAccessorImpl.invoke(NativeMethodAccessorImpl.java:62)
	at sun.reflect.DelegatingMethodAccessorImpl.invoke(DelegatingMethodAccessorImpl.java:43)
	at java.lang.reflect.Method.invoke(Method.java:498)
	at org.junit.runners.model.FrameworkMethod$1.runReflectiveCall(FrameworkMethod.java:50)
	at org.junit.internal.runners.model.ReflectiveCallable.run(ReflectiveCallable.java:12)
	at org.junit.runners.model.FrameworkMethod.invokeExplosively(FrameworkMethod.java:47)
	at org.junit.internal.runners.statements.InvokeMethod.evaluate(InvokeMethod.java:17)
	at org.junit.internal.runners.statements.RunBefores.evaluate(RunBefores.java:26)
	at org.junit.runners.ParentRunner.runLeaf(ParentRunner.java:325)
	at org.junit.runners.BlockJUnit4ClassRunner.runChild(BlockJUnit4ClassRunner.java:78)
	at org.junit.runners.BlockJUnit4ClassRunner.runChild(BlockJUnit4ClassRunner.java:57)
	at org.junit.runners.ParentRunner$3.run(ParentRunner.java:290)
	at org.junit.runners.ParentRunner$1.schedule(ParentRunner.java:71)
	at org.junit.runners.ParentRunner.runChildren(ParentRunner.java:288)
	at org.junit.runners.ParentRunner.access$000(ParentRunner.java:58)
	at org.junit.runners.ParentRunner$2.evaluate(ParentRunner.java:268)
	at org.junit.runners.ParentRunner.run(ParentRunner.java:363)
	at org.apache.maven.surefire.junit4.JUnit4Provider.execute(JUnit4Provider.java:367)
	at org.apache.maven.surefire.junit4.JUnit4Provider.executeWithRerun(JUnit4Provider.java:274)
	at org.apache.maven.surefire.junit4.JUnit4Provider.executeTestSet(JUnit4Provider.java:238)
	at org.apache.maven.surefire.junit4.JUnit4Provider.invoke(JUnit4Provider.java:161)
	at org.apache.maven.surefire.booter.ForkedBooter.invokeProviderInSameClassLoader(ForkedBooter.java:290)
	at org.apache.maven.surefire.booter.ForkedBooter.runSuitesInProcess(ForkedBooter.java:242)
	at org.apache.maven.surefire.booter.ForkedBooter.main(ForkedBooter.java:121)
19:17:22.558 [main] DEBUG net.anotheria.anoplass.api.generic.observation.ObservationAPIImpl - Firing update event for user 40, originator: 40 and subject: TEST
19:17:22.558 [main] DEBUG net.anotheria.anoplass.api.generic.observation.ObservationAPIImpl - Firing update event for current user, originator: 41 and subject: TEST
19:17:22.558 [main] WARN net.anotheria.anoplass.api.generic.observation.ObservationAPIImpl - (Uncaught exception in observer: net.anotheria.anoplass.api.generic.observation.ObservationAPITest$2@290d210d .notifySubjectUpdatedForCurrentUser(S: TEST, O: 41, U: current, T: 1523467042558, D: Wed. 11.04.2018, 19:17)
java.lang.RuntimeException: foo
	at net.anotheria.anoplass.api.generic.observation.ObservationAPITest$2.notifySubjectUpdatedForCurrentUser(ObservationAPITest.java:71)
	at net.anotheria.anoplass.api.generic.observation.ObservationAPIImpl.fireSubjectUpdateForCurrentUser(ObservationAPIImpl.java:52)
	at sun.reflect.GeneratedMethodAccessor4.invoke(Unknown Source)
	at sun.reflect.DelegatingMethodAccessorImpl.invoke(DelegatingMethodAccessorImpl.java:43)
	at java.lang.reflect.Method.invoke(Method.java:498)
	at net.anotheria.moskito.core.predefined.ServiceStatsCallHandler.invoke(ServiceStatsCallHandler.java:102)
	at net.anotheria.moskito.core.dynamic.MoskitoInvokationProxy.invoke(MoskitoInvokationProxy.java:183)
	at com.sun.proxy.$Proxy16.fireSubjectUpdateForCurrentUser(Unknown Source)
	at sun.reflect.GeneratedMethodAccessor4.invoke(Unknown Source)
	at sun.reflect.DelegatingMethodAccessorImpl.invoke(DelegatingMethodAccessorImpl.java:43)
	at java.lang.reflect.Method.invoke(Method.java:498)
	at net.anotheria.anoplass.api.APICallHandler.invoke(APICallHandler.java:92)
	at com.sun.proxy.$Proxy16.fireSubjectUpdateForCurrentUser(Unknown Source)
	at net.anotheria.anoplass.api.generic.observation.ObservationAPITest.testErrorInObserver(ObservationAPITest.java:78)
	at sun.reflect.NativeMethodAccessorImpl.invoke0(Native Method)
	at sun.reflect.NativeMethodAccessorImpl.invoke(NativeMethodAccessorImpl.java:62)
	at sun.reflect.DelegatingMethodAccessorImpl.invoke(DelegatingMethodAccessorImpl.java:43)
	at java.lang.reflect.Method.invoke(Method.java:498)
	at org.junit.runners.model.FrameworkMethod$1.runReflectiveCall(FrameworkMethod.java:50)
	at org.junit.internal.runners.model.ReflectiveCallable.run(ReflectiveCallable.java:12)
	at org.junit.runners.model.FrameworkMethod.invokeExplosively(FrameworkMethod.java:47)
	at org.junit.internal.runners.statements.InvokeMethod.evaluate(InvokeMethod.java:17)
	at org.junit.internal.runners.statements.RunBefores.evaluate(RunBefores.java:26)
	at org.junit.runners.ParentRunner.runLeaf(ParentRunner.java:325)
	at org.junit.runners.BlockJUnit4ClassRunner.runChild(BlockJUnit4ClassRunner.java:78)
	at org.junit.runners.BlockJUnit4ClassRunner.runChild(BlockJUnit4ClassRunner.java:57)
	at org.junit.runners.ParentRunner$3.run(ParentRunner.java:290)
	at org.junit.runners.ParentRunner$1.schedule(ParentRunner.java:71)
	at org.junit.runners.ParentRunner.runChildren(ParentRunner.java:288)
	at org.junit.runners.ParentRunner.access$000(ParentRunner.java:58)
	at org.junit.runners.ParentRunner$2.evaluate(ParentRunner.java:268)
	at org.junit.runners.ParentRunner.run(ParentRunner.java:363)
	at org.apache.maven.surefire.junit4.JUnit4Provider.execute(JUnit4Provider.java:367)
	at org.apache.maven.surefire.junit4.JUnit4Provider.executeWithRerun(JUnit4Provider.java:274)
	at org.apache.maven.surefire.junit4.JUnit4Provider.executeTestSet(JUnit4Provider.java:238)
	at org.apache.maven.surefire.junit4.JUnit4Provider.invoke(JUnit4Provider.java:161)
	at org.apache.maven.surefire.booter.ForkedBooter.invokeProviderInSameClassLoader(ForkedBooter.java:290)
	at org.apache.maven.surefire.booter.ForkedBooter.runSuitesInProcess(ForkedBooter.java:242)
	at org.apache.maven.surefire.booter.ForkedBooter.main(ForkedBooter.java:121)
19:17:22.563 [main] DEBUG net.anotheria.anoplass.api.generic.observation.ObservationAPIImpl - Firing update event for user 42, originator: 42 and subject: TEST
19:17:22.564 [main] DEBUG net.anotheria.anoplass.api.generic.observation.ObservationAPIImpl - Firing update event for current user, originator: 43 and subject: TEST
19:17:22.564 [main] WARN net.anotheria.anoplass.api.generic.observation.ObservationAPIImpl - (Uncaught exception in observer: net.anotheria.anoplass.api.generic.observation.ObservationAPITest$2@290d210d .notifySubjectUpdatedForCurrentUser(S: TEST, O: 43, U: current, T: 1523467042564, D: Wed. 11.04.2018, 19:17)
java.lang.RuntimeException: foo
	at net.anotheria.anoplass.api.generic.observation.ObservationAPITest$2.notifySubjectUpdatedForCurrentUser(ObservationAPITest.java:71)
	at net.anotheria.anoplass.api.generic.observation.ObservationAPIImpl.fireSubjectUpdateForCurrentUser(ObservationAPIImpl.java:52)
	at sun.reflect.GeneratedMethodAccessor4.invoke(Unknown Source)
	at sun.reflect.DelegatingMethodAccessorImpl.invoke(DelegatingMethodAccessorImpl.java:43)
	at java.lang.reflect.Method.invoke(Method.java:498)
	at net.anotheria.moskito.core.predefined.ServiceStatsCallHandler.invoke(ServiceStatsCallHandler.java:102)
	at net.anotheria.moskito.core.dynamic.MoskitoInvokationProxy.invoke(MoskitoInvokationProxy.java:183)
	at com.sun.proxy.$Proxy16.fireSubjectUpdateForCurrentUser(Unknown Source)
	at sun.reflect.GeneratedMethodAccessor4.invoke(Unknown Source)
	at sun.reflect.DelegatingMethodAccessorImpl.invoke(DelegatingMethodAccessorImpl.java:43)
	at java.lang.reflect.Method.invoke(Method.java:498)
	at net.anotheria.anoplass.api.APICallHandler.invoke(APICallHandler.java:92)
	at com.sun.proxy.$Proxy16.fireSubjectUpdateForCurrentUser(Unknown Source)
	at net.anotheria.anoplass.api.generic.observation.ObservationAPITest.testErrorInObserver(ObservationAPITest.java:78)
	at sun.reflect.NativeMethodAccessorImpl.invoke0(Native Method)
	at sun.reflect.NativeMethodAccessorImpl.invoke(NativeMethodAccessorImpl.java:62)
	at sun.reflect.DelegatingMethodAccessorImpl.invoke(DelegatingMethodAccessorImpl.java:43)
	at java.lang.reflect.Method.invoke(Method.java:498)
	at org.junit.runners.model.FrameworkMethod$1.runReflectiveCall(FrameworkMethod.java:50)
	at org.junit.internal.runners.model.ReflectiveCallable.run(ReflectiveCallable.java:12)
	at org.junit.runners.model.FrameworkMethod.invokeExplosively(FrameworkMethod.java:47)
	at org.junit.internal.runners.statements.InvokeMethod.evaluate(InvokeMethod.java:17)
	at org.junit.internal.runners.statements.RunBefores.evaluate(RunBefores.java:26)
	at org.junit.runners.ParentRunner.runLeaf(ParentRunner.java:325)
	at org.junit.runners.BlockJUnit4ClassRunner.runChild(BlockJUnit4ClassRunner.java:78)
	at org.junit.runners.BlockJUnit4ClassRunner.runChild(BlockJUnit4ClassRunner.java:57)
	at org.junit.runners.ParentRunner$3.run(ParentRunner.java:290)
	at org.junit.runners.ParentRunner$1.schedule(ParentRunner.java:71)
	at org.junit.runners.ParentRunner.runChildren(ParentRunner.java:288)
	at org.junit.runners.ParentRunner.access$000(ParentRunner.java:58)
	at org.junit.runners.ParentRunner$2.evaluate(ParentRunner.java:268)
	at org.junit.runners.ParentRunner.run(ParentRunner.java:363)
	at org.apache.maven.surefire.junit4.JUnit4Provider.execute(JUnit4Provider.java:367)
	at org.apache.maven.surefire.junit4.JUnit4Provider.executeWithRerun(JUnit4Provider.java:274)
	at org.apache.maven.surefire.junit4.JUnit4Provider.executeTestSet(JUnit4Provider.java:238)
	at org.apache.maven.surefire.junit4.JUnit4Provider.invoke(JUnit4Provider.java:161)
	at org.apache.maven.surefire.booter.ForkedBooter.invokeProviderInSameClassLoader(ForkedBooter.java:290)
	at org.apache.maven.surefire.booter.ForkedBooter.runSuitesInProcess(ForkedBooter.java:242)
	at org.apache.maven.surefire.booter.ForkedBooter.main(ForkedBooter.java:121)
19:17:22.565 [main] DEBUG net.anotheria.anoplass.api.generic.observation.ObservationAPIImpl - Firing update event for user 44, originator: 44 and subject: TEST
19:17:22.565 [main] DEBUG net.anotheria.anoplass.api.generic.observation.ObservationAPIImpl - Firing update event for current user, originator: 45 and subject: TEST
19:17:22.565 [main] WARN net.anotheria.anoplass.api.generic.observation.ObservationAPIImpl - (Uncaught exception in observer: net.anotheria.anoplass.api.generic.observation.ObservationAPITest$2@290d210d .notifySubjectUpdatedForCurrentUser(S: TEST, O: 45, U: current, T: 1523467042565, D: Wed. 11.04.2018, 19:17)
java.lang.RuntimeException: foo
	at net.anotheria.anoplass.api.generic.observation.ObservationAPITest$2.notifySubjectUpdatedForCurrentUser(ObservationAPITest.java:71)
	at net.anotheria.anoplass.api.generic.observation.ObservationAPIImpl.fireSubjectUpdateForCurrentUser(ObservationAPIImpl.java:52)
	at sun.reflect.GeneratedMethodAccessor4.invoke(Unknown Source)
	at sun.reflect.DelegatingMethodAccessorImpl.invoke(DelegatingMethodAccessorImpl.java:43)
	at java.lang.reflect.Method.invoke(Method.java:498)
	at net.anotheria.moskito.core.predefined.ServiceStatsCallHandler.invoke(ServiceStatsCallHandler.java:102)
	at net.anotheria.moskito.core.dynamic.MoskitoInvokationProxy.invoke(MoskitoInvokationProxy.java:183)
	at com.sun.proxy.$Proxy16.fireSubjectUpdateForCurrentUser(Unknown Source)
	at sun.reflect.GeneratedMethodAccessor4.invoke(Unknown Source)
	at sun.reflect.DelegatingMethodAccessorImpl.invoke(DelegatingMethodAccessorImpl.java:43)
	at java.lang.reflect.Method.invoke(Method.java:498)
	at net.anotheria.anoplass.api.APICallHandler.invoke(APICallHandler.java:92)
	at com.sun.proxy.$Proxy16.fireSubjectUpdateForCurrentUser(Unknown Source)
	at net.anotheria.anoplass.api.generic.observation.ObservationAPITest.testErrorInObserver(ObservationAPITest.java:78)
	at sun.reflect.NativeMethodAccessorImpl.invoke0(Native Method)
	at sun.reflect.NativeMethodAccessorImpl.invoke(NativeMethodAccessorImpl.java:62)
	at sun.reflect.DelegatingMethodAccessorImpl.invoke(DelegatingMethodAccessorImpl.java:43)
	at java.lang.reflect.Method.invoke(Method.java:498)
	at org.junit.runners.model.FrameworkMethod$1.runReflectiveCall(FrameworkMethod.java:50)
	at org.junit.internal.runners.model.ReflectiveCallable.run(ReflectiveCallable.java:12)
	at org.junit.runners.model.FrameworkMethod.invokeExplosively(FrameworkMethod.java:47)
	at org.junit.internal.runners.statements.InvokeMethod.evaluate(InvokeMethod.java:17)
	at org.junit.internal.runners.statements.RunBefores.evaluate(RunBefores.java:26)
	at org.junit.runners.ParentRunner.runLeaf(ParentRunner.java:325)
	at org.junit.runners.BlockJUnit4ClassRunner.runChild(BlockJUnit4ClassRunner.java:78)
	at org.junit.runners.BlockJUnit4ClassRunner.runChild(BlockJUnit4ClassRunner.java:57)
	at org.junit.runners.ParentRunner$3.run(ParentRunner.java:290)
	at org.junit.runners.ParentRunner$1.schedule(ParentRunner.java:71)
	at org.junit.runners.ParentRunner.runChildren(ParentRunner.java:288)
	at org.junit.runners.ParentRunner.access$000(ParentRunner.java:58)
	at org.junit.runners.ParentRunner$2.evaluate(ParentRunner.java:268)
	at org.junit.runners.ParentRunner.run(ParentRunner.java:363)
	at org.apache.maven.surefire.junit4.JUnit4Provider.execute(JUnit4Provider.java:367)
	at org.apache.maven.surefire.junit4.JUnit4Provider.executeWithRerun(JUnit4Provider.java:274)
	at org.apache.maven.surefire.junit4.JUnit4Provider.executeTestSet(JUnit4Provider.java:238)
	at org.apache.maven.surefire.junit4.JUnit4Provider.invoke(JUnit4Provider.java:161)
	at org.apache.maven.surefire.booter.ForkedBooter.invokeProviderInSameClassLoader(ForkedBooter.java:290)
	at org.apache.maven.surefire.booter.ForkedBooter.runSuitesInProcess(ForkedBooter.java:242)
	at org.apache.maven.surefire.booter.ForkedBooter.main(ForkedBooter.java:121)
19:17:22.566 [main] DEBUG net.anotheria.anoplass.api.generic.observation.ObservationAPIImpl - Firing update event for user 46, originator: 46 and subject: TEST
19:17:22.566 [main] DEBUG net.anotheria.anoplass.api.generic.observation.ObservationAPIImpl - Firing update event for current user, originator: 47 and subject: TEST
19:17:22.566 [main] WARN net.anotheria.anoplass.api.generic.observation.ObservationAPIImpl - (Uncaught exception in observer: net.anotheria.anoplass.api.generic.observation.ObservationAPITest$2@290d210d .notifySubjectUpdatedForCurrentUser(S: TEST, O: 47, U: current, T: 1523467042566, D: Wed. 11.04.2018, 19:17)
java.lang.RuntimeException: foo
	at net.anotheria.anoplass.api.generic.observation.ObservationAPITest$2.notifySubjectUpdatedForCurrentUser(ObservationAPITest.java:71)
	at net.anotheria.anoplass.api.generic.observation.ObservationAPIImpl.fireSubjectUpdateForCurrentUser(ObservationAPIImpl.java:52)
	at sun.reflect.GeneratedMethodAccessor4.invoke(Unknown Source)
	at sun.reflect.DelegatingMethodAccessorImpl.invoke(DelegatingMethodAccessorImpl.java:43)
	at java.lang.reflect.Method.invoke(Method.java:498)
	at net.anotheria.moskito.core.predefined.ServiceStatsCallHandler.invoke(ServiceStatsCallHandler.java:102)
	at net.anotheria.moskito.core.dynamic.MoskitoInvokationProxy.invoke(MoskitoInvokationProxy.java:183)
	at com.sun.proxy.$Proxy16.fireSubjectUpdateForCurrentUser(Unknown Source)
	at sun.reflect.GeneratedMethodAccessor4.invoke(Unknown Source)
	at sun.reflect.DelegatingMethodAccessorImpl.invoke(DelegatingMethodAccessorImpl.java:43)
	at java.lang.reflect.Method.invoke(Method.java:498)
	at net.anotheria.anoplass.api.APICallHandler.invoke(APICallHandler.java:92)
	at com.sun.proxy.$Proxy16.fireSubjectUpdateForCurrentUser(Unknown Source)
	at net.anotheria.anoplass.api.generic.observation.ObservationAPITest.testErrorInObserver(ObservationAPITest.java:78)
	at sun.reflect.NativeMethodAccessorImpl.invoke0(Native Method)
	at sun.reflect.NativeMethodAccessorImpl.invoke(NativeMethodAccessorImpl.java:62)
	at sun.reflect.DelegatingMethodAccessorImpl.invoke(DelegatingMethodAccessorImpl.java:43)
	at java.lang.reflect.Method.invoke(Method.java:498)
	at org.junit.runners.model.FrameworkMethod$1.runReflectiveCall(FrameworkMethod.java:50)
	at org.junit.internal.runners.model.ReflectiveCallable.run(ReflectiveCallable.java:12)
	at org.junit.runners.model.FrameworkMethod.invokeExplosively(FrameworkMethod.java:47)
	at org.junit.internal.runners.statements.InvokeMethod.evaluate(InvokeMethod.java:17)
	at org.junit.internal.runners.statements.RunBefores.evaluate(RunBefores.java:26)
	at org.junit.runners.ParentRunner.runLeaf(ParentRunner.java:325)
	at org.junit.runners.BlockJUnit4ClassRunner.runChild(BlockJUnit4ClassRunner.java:78)
	at org.junit.runners.BlockJUnit4ClassRunner.runChild(BlockJUnit4ClassRunner.java:57)
	at org.junit.runners.ParentRunner$3.run(ParentRunner.java:290)
	at org.junit.runners.ParentRunner$1.schedule(ParentRunner.java:71)
	at org.junit.runners.ParentRunner.runChildren(ParentRunner.java:288)
	at org.junit.runners.ParentRunner.access$000(ParentRunner.java:58)
	at org.junit.runners.ParentRunner$2.evaluate(ParentRunner.java:268)
	at org.junit.runners.ParentRunner.run(ParentRunner.java:363)
	at org.apache.maven.surefire.junit4.JUnit4Provider.execute(JUnit4Provider.java:367)
	at org.apache.maven.surefire.junit4.JUnit4Provider.executeWithRerun(JUnit4Provider.java:274)
	at org.apache.maven.surefire.junit4.JUnit4Provider.executeTestSet(JUnit4Provider.java:238)
	at org.apache.maven.surefire.junit4.JUnit4Provider.invoke(JUnit4Provider.java:161)
	at org.apache.maven.surefire.booter.ForkedBooter.invokeProviderInSameClassLoader(ForkedBooter.java:290)
	at org.apache.maven.surefire.booter.ForkedBooter.runSuitesInProcess(ForkedBooter.java:242)
	at org.apache.maven.surefire.booter.ForkedBooter.main(ForkedBooter.java:121)
19:17:22.566 [main] DEBUG net.anotheria.anoplass.api.generic.observation.ObservationAPIImpl - Firing update event for user 48, originator: 48 and subject: TEST
19:17:22.566 [main] DEBUG net.anotheria.anoplass.api.generic.observation.ObservationAPIImpl - Firing update event for current user, originator: 49 and subject: TEST
19:17:22.567 [main] WARN net.anotheria.anoplass.api.generic.observation.ObservationAPIImpl - (Uncaught exception in observer: net.anotheria.anoplass.api.generic.observation.ObservationAPITest$2@290d210d .notifySubjectUpdatedForCurrentUser(S: TEST, O: 49, U: current, T: 1523467042567, D: Wed. 11.04.2018, 19:17)
java.lang.RuntimeException: foo
	at net.anotheria.anoplass.api.generic.observation.ObservationAPITest$2.notifySubjectUpdatedForCurrentUser(ObservationAPITest.java:71)
	at net.anotheria.anoplass.api.generic.observation.ObservationAPIImpl.fireSubjectUpdateForCurrentUser(ObservationAPIImpl.java:52)
	at sun.reflect.GeneratedMethodAccessor4.invoke(Unknown Source)
	at sun.reflect.DelegatingMethodAccessorImpl.invoke(DelegatingMethodAccessorImpl.java:43)
	at java.lang.reflect.Method.invoke(Method.java:498)
	at net.anotheria.moskito.core.predefined.ServiceStatsCallHandler.invoke(ServiceStatsCallHandler.java:102)
	at net.anotheria.moskito.core.dynamic.MoskitoInvokationProxy.invoke(MoskitoInvokationProxy.java:183)
	at com.sun.proxy.$Proxy16.fireSubjectUpdateForCurrentUser(Unknown Source)
	at sun.reflect.GeneratedMethodAccessor4.invoke(Unknown Source)
	at sun.reflect.DelegatingMethodAccessorImpl.invoke(DelegatingMethodAccessorImpl.java:43)
	at java.lang.reflect.Method.invoke(Method.java:498)
	at net.anotheria.anoplass.api.APICallHandler.invoke(APICallHandler.java:92)
	at com.sun.proxy.$Proxy16.fireSubjectUpdateForCurrentUser(Unknown Source)
	at net.anotheria.anoplass.api.generic.observation.ObservationAPITest.testErrorInObserver(ObservationAPITest.java:78)
	at sun.reflect.NativeMethodAccessorImpl.invoke0(Native Method)
	at sun.reflect.NativeMethodAccessorImpl.invoke(NativeMethodAccessorImpl.java:62)
	at sun.reflect.DelegatingMethodAccessorImpl.invoke(DelegatingMethodAccessorImpl.java:43)
	at java.lang.reflect.Method.invoke(Method.java:498)
	at org.junit.runners.model.FrameworkMethod$1.runReflectiveCall(FrameworkMethod.java:50)
	at org.junit.internal.runners.model.ReflectiveCallable.run(ReflectiveCallable.java:12)
	at org.junit.runners.model.FrameworkMethod.invokeExplosively(FrameworkMethod.java:47)
	at org.junit.internal.runners.statements.InvokeMethod.evaluate(InvokeMethod.java:17)
	at org.junit.internal.runners.statements.RunBefores.evaluate(RunBefores.java:26)
	at org.junit.runners.ParentRunner.runLeaf(ParentRunner.java:325)
	at org.junit.runners.BlockJUnit4ClassRunner.runChild(BlockJUnit4ClassRunner.java:78)
	at org.junit.runners.BlockJUnit4ClassRunner.runChild(BlockJUnit4ClassRunner.java:57)
	at org.junit.runners.ParentRunner$3.run(ParentRunner.java:290)
	at org.junit.runners.ParentRunner$1.schedule(ParentRunner.java:71)
	at org.junit.runners.ParentRunner.runChildren(ParentRunner.java:288)
	at org.junit.runners.ParentRunner.access$000(ParentRunner.java:58)
	at org.junit.runners.ParentRunner$2.evaluate(ParentRunner.java:268)
	at org.junit.runners.ParentRunner.run(ParentRunner.java:363)
	at org.apache.maven.surefire.junit4.JUnit4Provider.execute(JUnit4Provider.java:367)
	at org.apache.maven.surefire.junit4.JUnit4Provider.executeWithRerun(JUnit4Provider.java:274)
	at org.apache.maven.surefire.junit4.JUnit4Provider.executeTestSet(JUnit4Provider.java:238)
	at org.apache.maven.surefire.junit4.JUnit4Provider.invoke(JUnit4Provider.java:161)
	at org.apache.maven.surefire.booter.ForkedBooter.invokeProviderInSameClassLoader(ForkedBooter.java:290)
	at org.apache.maven.surefire.booter.ForkedBooter.runSuitesInProcess(ForkedBooter.java:242)
	at org.apache.maven.surefire.booter.ForkedBooter.main(ForkedBooter.java:121)
19:17:22.567 [main] DEBUG net.anotheria.anoplass.api.generic.observation.ObservationAPIImpl - Firing update event for user 50, originator: 50 and subject: TEST
19:17:22.567 [main] DEBUG net.anotheria.anoplass.api.generic.observation.ObservationAPIImpl - Firing update event for current user, originator: 51 and subject: TEST
19:17:22.568 [main] WARN net.anotheria.anoplass.api.generic.observation.ObservationAPIImpl - (Uncaught exception in observer: net.anotheria.anoplass.api.generic.observation.ObservationAPITest$2@290d210d .notifySubjectUpdatedForCurrentUser(S: TEST, O: 51, U: current, T: 1523467042567, D: Wed. 11.04.2018, 19:17)
java.lang.RuntimeException: foo
	at net.anotheria.anoplass.api.generic.observation.ObservationAPITest$2.notifySubjectUpdatedForCurrentUser(ObservationAPITest.java:71)
	at net.anotheria.anoplass.api.generic.observation.ObservationAPIImpl.fireSubjectUpdateForCurrentUser(ObservationAPIImpl.java:52)
	at sun.reflect.GeneratedMethodAccessor4.invoke(Unknown Source)
	at sun.reflect.DelegatingMethodAccessorImpl.invoke(DelegatingMethodAccessorImpl.java:43)
	at java.lang.reflect.Method.invoke(Method.java:498)
	at net.anotheria.moskito.core.predefined.ServiceStatsCallHandler.invoke(ServiceStatsCallHandler.java:102)
	at net.anotheria.moskito.core.dynamic.MoskitoInvokationProxy.invoke(MoskitoInvokationProxy.java:183)
	at com.sun.proxy.$Proxy16.fireSubjectUpdateForCurrentUser(Unknown Source)
	at sun.reflect.GeneratedMethodAccessor4.invoke(Unknown Source)
	at sun.reflect.DelegatingMethodAccessorImpl.invoke(DelegatingMethodAccessorImpl.java:43)
	at java.lang.reflect.Method.invoke(Method.java:498)
	at net.anotheria.anoplass.api.APICallHandler.invoke(APICallHandler.java:92)
	at com.sun.proxy.$Proxy16.fireSubjectUpdateForCurrentUser(Unknown Source)
	at net.anotheria.anoplass.api.generic.observation.ObservationAPITest.testErrorInObserver(ObservationAPITest.java:78)
	at sun.reflect.NativeMethodAccessorImpl.invoke0(Native Method)
	at sun.reflect.NativeMethodAccessorImpl.invoke(NativeMethodAccessorImpl.java:62)
	at sun.reflect.DelegatingMethodAccessorImpl.invoke(DelegatingMethodAccessorImpl.java:43)
	at java.lang.reflect.Method.invoke(Method.java:498)
	at org.junit.runners.model.FrameworkMethod$1.runReflectiveCall(FrameworkMethod.java:50)
	at org.junit.internal.runners.model.ReflectiveCallable.run(ReflectiveCallable.java:12)
	at org.junit.runners.model.FrameworkMethod.invokeExplosively(FrameworkMethod.java:47)
	at org.junit.internal.runners.statements.InvokeMethod.evaluate(InvokeMethod.java:17)
	at org.junit.internal.runners.statements.RunBefores.evaluate(RunBefores.java:26)
	at org.junit.runners.ParentRunner.runLeaf(ParentRunner.java:325)
	at org.junit.runners.BlockJUnit4ClassRunner.runChild(BlockJUnit4ClassRunner.java:78)
	at org.junit.runners.BlockJUnit4ClassRunner.runChild(BlockJUnit4ClassRunner.java:57)
	at org.junit.runners.ParentRunner$3.run(ParentRunner.java:290)
	at org.junit.runners.ParentRunner$1.schedule(ParentRunner.java:71)
	at org.junit.runners.ParentRunner.runChildren(ParentRunner.java:288)
	at org.junit.runners.ParentRunner.access$000(ParentRunner.java:58)
	at org.junit.runners.ParentRunner$2.evaluate(ParentRunner.java:268)
	at org.junit.runners.ParentRunner.run(ParentRunner.java:363)
	at org.apache.maven.surefire.junit4.JUnit4Provider.execute(JUnit4Provider.java:367)
	at org.apache.maven.surefire.junit4.JUnit4Provider.executeWithRerun(JUnit4Provider.java:274)
	at org.apache.maven.surefire.junit4.JUnit4Provider.executeTestSet(JUnit4Provider.java:238)
	at org.apache.maven.surefire.junit4.JUnit4Provider.invoke(JUnit4Provider.java:161)
	at org.apache.maven.surefire.booter.ForkedBooter.invokeProviderInSameClassLoader(ForkedBooter.java:290)
	at org.apache.maven.surefire.booter.ForkedBooter.runSuitesInProcess(ForkedBooter.java:242)
	at org.apache.maven.surefire.booter.ForkedBooter.main(ForkedBooter.java:121)
19:17:22.568 [main] DEBUG net.anotheria.anoplass.api.generic.observation.ObservationAPIImpl - Firing update event for user 52, originator: 52 and subject: TEST
19:17:22.568 [main] DEBUG net.anotheria.anoplass.api.generic.observation.ObservationAPIImpl - Firing update event for current user, originator: 53 and subject: TEST
19:17:22.569 [main] WARN net.anotheria.anoplass.api.generic.observation.ObservationAPIImpl - (Uncaught exception in observer: net.anotheria.anoplass.api.generic.observation.ObservationAPITest$2@290d210d .notifySubjectUpdatedForCurrentUser(S: TEST, O: 53, U: current, T: 1523467042569, D: Wed. 11.04.2018, 19:17)
java.lang.RuntimeException: foo
	at net.anotheria.anoplass.api.generic.observation.ObservationAPITest$2.notifySubjectUpdatedForCurrentUser(ObservationAPITest.java:71)
	at net.anotheria.anoplass.api.generic.observation.ObservationAPIImpl.fireSubjectUpdateForCurrentUser(ObservationAPIImpl.java:52)
	at sun.reflect.GeneratedMethodAccessor4.invoke(Unknown Source)
	at sun.reflect.DelegatingMethodAccessorImpl.invoke(DelegatingMethodAccessorImpl.java:43)
	at java.lang.reflect.Method.invoke(Method.java:498)
	at net.anotheria.moskito.core.predefined.ServiceStatsCallHandler.invoke(ServiceStatsCallHandler.java:102)
	at net.anotheria.moskito.core.dynamic.MoskitoInvokationProxy.invoke(MoskitoInvokationProxy.java:183)
	at com.sun.proxy.$Proxy16.fireSubjectUpdateForCurrentUser(Unknown Source)
	at sun.reflect.GeneratedMethodAccessor4.invoke(Unknown Source)
	at sun.reflect.DelegatingMethodAccessorImpl.invoke(DelegatingMethodAccessorImpl.java:43)
	at java.lang.reflect.Method.invoke(Method.java:498)
	at net.anotheria.anoplass.api.APICallHandler.invoke(APICallHandler.java:92)
	at com.sun.proxy.$Proxy16.fireSubjectUpdateForCurrentUser(Unknown Source)
	at net.anotheria.anoplass.api.generic.observation.ObservationAPITest.testErrorInObserver(ObservationAPITest.java:78)
	at sun.reflect.NativeMethodAccessorImpl.invoke0(Native Method)
	at sun.reflect.NativeMethodAccessorImpl.invoke(NativeMethodAccessorImpl.java:62)
	at sun.reflect.DelegatingMethodAccessorImpl.invoke(DelegatingMethodAccessorImpl.java:43)
	at java.lang.reflect.Method.invoke(Method.java:498)
	at org.junit.runners.model.FrameworkMethod$1.runReflectiveCall(FrameworkMethod.java:50)
	at org.junit.internal.runners.model.ReflectiveCallable.run(ReflectiveCallable.java:12)
	at org.junit.runners.model.FrameworkMethod.invokeExplosively(FrameworkMethod.java:47)
	at org.junit.internal.runners.statements.InvokeMethod.evaluate(InvokeMethod.java:17)
	at org.junit.internal.runners.statements.RunBefores.evaluate(RunBefores.java:26)
	at org.junit.runners.ParentRunner.runLeaf(ParentRunner.java:325)
	at org.junit.runners.BlockJUnit4ClassRunner.runChild(BlockJUnit4ClassRunner.java:78)
	at org.junit.runners.BlockJUnit4ClassRunner.runChild(BlockJUnit4ClassRunner.java:57)
	at org.junit.runners.ParentRunner$3.run(ParentRunner.java:290)
	at org.junit.runners.ParentRunner$1.schedule(ParentRunner.java:71)
	at org.junit.runners.ParentRunner.runChildren(ParentRunner.java:288)
	at org.junit.runners.ParentRunner.access$000(ParentRunner.java:58)
	at org.junit.runners.ParentRunner$2.evaluate(ParentRunner.java:268)
	at org.junit.runners.ParentRunner.run(ParentRunner.java:363)
	at org.apache.maven.surefire.junit4.JUnit4Provider.execute(JUnit4Provider.java:367)
	at org.apache.maven.surefire.junit4.JUnit4Provider.executeWithRerun(JUnit4Provider.java:274)
	at org.apache.maven.surefire.junit4.JUnit4Provider.executeTestSet(JUnit4Provider.java:238)
	at org.apache.maven.surefire.junit4.JUnit4Provider.invoke(JUnit4Provider.java:161)
	at org.apache.maven.surefire.booter.ForkedBooter.invokeProviderInSameClassLoader(ForkedBooter.java:290)
	at org.apache.maven.surefire.booter.ForkedBooter.runSuitesInProcess(ForkedBooter.java:242)
	at org.apache.maven.surefire.booter.ForkedBooter.main(ForkedBooter.java:121)
19:17:22.569 [main] DEBUG net.anotheria.anoplass.api.generic.observation.ObservationAPIImpl - Firing update event for user 54, originator: 54 and subject: TEST
19:17:22.569 [main] DEBUG net.anotheria.anoplass.api.generic.observation.ObservationAPIImpl - Firing update event for current user, originator: 55 and subject: TEST
19:17:22.570 [main] WARN net.anotheria.anoplass.api.generic.observation.ObservationAPIImpl - (Uncaught exception in observer: net.anotheria.anoplass.api.generic.observation.ObservationAPITest$2@290d210d .notifySubjectUpdatedForCurrentUser(S: TEST, O: 55, U: current, T: 1523467042569, D: Wed. 11.04.2018, 19:17)
java.lang.RuntimeException: foo
	at net.anotheria.anoplass.api.generic.observation.ObservationAPITest$2.notifySubjectUpdatedForCurrentUser(ObservationAPITest.java:71)
	at net.anotheria.anoplass.api.generic.observation.ObservationAPIImpl.fireSubjectUpdateForCurrentUser(ObservationAPIImpl.java:52)
	at sun.reflect.GeneratedMethodAccessor4.invoke(Unknown Source)
	at sun.reflect.DelegatingMethodAccessorImpl.invoke(DelegatingMethodAccessorImpl.java:43)
	at java.lang.reflect.Method.invoke(Method.java:498)
	at net.anotheria.moskito.core.predefined.ServiceStatsCallHandler.invoke(ServiceStatsCallHandler.java:102)
	at net.anotheria.moskito.core.dynamic.MoskitoInvokationProxy.invoke(MoskitoInvokationProxy.java:183)
	at com.sun.proxy.$Proxy16.fireSubjectUpdateForCurrentUser(Unknown Source)
	at sun.reflect.GeneratedMethodAccessor4.invoke(Unknown Source)
	at sun.reflect.DelegatingMethodAccessorImpl.invoke(DelegatingMethodAccessorImpl.java:43)
	at java.lang.reflect.Method.invoke(Method.java:498)
	at net.anotheria.anoplass.api.APICallHandler.invoke(APICallHandler.java:92)
	at com.sun.proxy.$Proxy16.fireSubjectUpdateForCurrentUser(Unknown Source)
	at net.anotheria.anoplass.api.generic.observation.ObservationAPITest.testErrorInObserver(ObservationAPITest.java:78)
	at sun.reflect.NativeMethodAccessorImpl.invoke0(Native Method)
	at sun.reflect.NativeMethodAccessorImpl.invoke(NativeMethodAccessorImpl.java:62)
	at sun.reflect.DelegatingMethodAccessorImpl.invoke(DelegatingMethodAccessorImpl.java:43)
	at java.lang.reflect.Method.invoke(Method.java:498)
	at org.junit.runners.model.FrameworkMethod$1.runReflectiveCall(FrameworkMethod.java:50)
	at org.junit.internal.runners.model.ReflectiveCallable.run(ReflectiveCallable.java:12)
	at org.junit.runners.model.FrameworkMethod.invokeExplosively(FrameworkMethod.java:47)
	at org.junit.internal.runners.statements.InvokeMethod.evaluate(InvokeMethod.java:17)
	at org.junit.internal.runners.statements.RunBefores.evaluate(RunBefores.java:26)
	at org.junit.runners.ParentRunner.runLeaf(ParentRunner.java:325)
	at org.junit.runners.BlockJUnit4ClassRunner.runChild(BlockJUnit4ClassRunner.java:78)
	at org.junit.runners.BlockJUnit4ClassRunner.runChild(BlockJUnit4ClassRunner.java:57)
	at org.junit.runners.ParentRunner$3.run(ParentRunner.java:290)
	at org.junit.runners.ParentRunner$1.schedule(ParentRunner.java:71)
	at org.junit.runners.ParentRunner.runChildren(ParentRunner.java:288)
	at org.junit.runners.ParentRunner.access$000(ParentRunner.java:58)
	at org.junit.runners.ParentRunner$2.evaluate(ParentRunner.java:268)
	at org.junit.runners.ParentRunner.run(ParentRunner.java:363)
	at org.apache.maven.surefire.junit4.JUnit4Provider.execute(JUnit4Provider.java:367)
	at org.apache.maven.surefire.junit4.JUnit4Provider.executeWithRerun(JUnit4Provider.java:274)
	at org.apache.maven.surefire.junit4.JUnit4Provider.executeTestSet(JUnit4Provider.java:238)
	at org.apache.maven.surefire.junit4.JUnit4Provider.invoke(JUnit4Provider.java:161)
	at org.apache.maven.surefire.booter.ForkedBooter.invokeProviderInSameClassLoader(ForkedBooter.java:290)
	at org.apache.maven.surefire.booter.ForkedBooter.runSuitesInProcess(ForkedBooter.java:242)
	at org.apache.maven.surefire.booter.ForkedBooter.main(ForkedBooter.java:121)
19:17:22.570 [main] DEBUG net.anotheria.anoplass.api.generic.observation.ObservationAPIImpl - Firing update event for user 56, originator: 56 and subject: TEST
19:17:22.570 [main] DEBUG net.anotheria.anoplass.api.generic.observation.ObservationAPIImpl - Firing update event for current user, originator: 57 and subject: TEST
19:17:22.571 [main] WARN net.anotheria.anoplass.api.generic.observation.ObservationAPIImpl - (Uncaught exception in observer: net.anotheria.anoplass.api.generic.observation.ObservationAPITest$2@290d210d .notifySubjectUpdatedForCurrentUser(S: TEST, O: 57, U: current, T: 1523467042571, D: Wed. 11.04.2018, 19:17)
java.lang.RuntimeException: foo
	at net.anotheria.anoplass.api.generic.observation.ObservationAPITest$2.notifySubjectUpdatedForCurrentUser(ObservationAPITest.java:71)
	at net.anotheria.anoplass.api.generic.observation.ObservationAPIImpl.fireSubjectUpdateForCurrentUser(ObservationAPIImpl.java:52)
	at sun.reflect.GeneratedMethodAccessor4.invoke(Unknown Source)
	at sun.reflect.DelegatingMethodAccessorImpl.invoke(DelegatingMethodAccessorImpl.java:43)
	at java.lang.reflect.Method.invoke(Method.java:498)
	at net.anotheria.moskito.core.predefined.ServiceStatsCallHandler.invoke(ServiceStatsCallHandler.java:102)
	at net.anotheria.moskito.core.dynamic.MoskitoInvokationProxy.invoke(MoskitoInvokationProxy.java:183)
	at com.sun.proxy.$Proxy16.fireSubjectUpdateForCurrentUser(Unknown Source)
	at sun.reflect.GeneratedMethodAccessor4.invoke(Unknown Source)
	at sun.reflect.DelegatingMethodAccessorImpl.invoke(DelegatingMethodAccessorImpl.java:43)
	at java.lang.reflect.Method.invoke(Method.java:498)
	at net.anotheria.anoplass.api.APICallHandler.invoke(APICallHandler.java:92)
	at com.sun.proxy.$Proxy16.fireSubjectUpdateForCurrentUser(Unknown Source)
	at net.anotheria.anoplass.api.generic.observation.ObservationAPITest.testErrorInObserver(ObservationAPITest.java:78)
	at sun.reflect.NativeMethodAccessorImpl.invoke0(Native Method)
	at sun.reflect.NativeMethodAccessorImpl.invoke(NativeMethodAccessorImpl.java:62)
	at sun.reflect.DelegatingMethodAccessorImpl.invoke(DelegatingMethodAccessorImpl.java:43)
	at java.lang.reflect.Method.invoke(Method.java:498)
	at org.junit.runners.model.FrameworkMethod$1.runReflectiveCall(FrameworkMethod.java:50)
	at org.junit.internal.runners.model.ReflectiveCallable.run(ReflectiveCallable.java:12)
	at org.junit.runners.model.FrameworkMethod.invokeExplosively(FrameworkMethod.java:47)
	at org.junit.internal.runners.statements.InvokeMethod.evaluate(InvokeMethod.java:17)
	at org.junit.internal.runners.statements.RunBefores.evaluate(RunBefores.java:26)
	at org.junit.runners.ParentRunner.runLeaf(ParentRunner.java:325)
	at org.junit.runners.BlockJUnit4ClassRunner.runChild(BlockJUnit4ClassRunner.java:78)
	at org.junit.runners.BlockJUnit4ClassRunner.runChild(BlockJUnit4ClassRunner.java:57)
	at org.junit.runners.ParentRunner$3.run(ParentRunner.java:290)
	at org.junit.runners.ParentRunner$1.schedule(ParentRunner.java:71)
	at org.junit.runners.ParentRunner.runChildren(ParentRunner.java:288)
	at org.junit.runners.ParentRunner.access$000(ParentRunner.java:58)
	at org.junit.runners.ParentRunner$2.evaluate(ParentRunner.java:268)
	at org.junit.runners.ParentRunner.run(ParentRunner.java:363)
	at org.apache.maven.surefire.junit4.JUnit4Provider.execute(JUnit4Provider.java:367)
	at org.apache.maven.surefire.junit4.JUnit4Provider.executeWithRerun(JUnit4Provider.java:274)
	at org.apache.maven.surefire.junit4.JUnit4Provider.executeTestSet(JUnit4Provider.java:238)
	at org.apache.maven.surefire.junit4.JUnit4Provider.invoke(JUnit4Provider.java:161)
	at org.apache.maven.surefire.booter.ForkedBooter.invokeProviderInSameClassLoader(ForkedBooter.java:290)
	at org.apache.maven.surefire.booter.ForkedBooter.runSuitesInProcess(ForkedBooter.java:242)
	at org.apache.maven.surefire.booter.ForkedBooter.main(ForkedBooter.java:121)
19:17:22.571 [main] DEBUG net.anotheria.anoplass.api.generic.observation.ObservationAPIImpl - Firing update event for user 58, originator: 58 and subject: TEST
19:17:22.571 [main] DEBUG net.anotheria.anoplass.api.generic.observation.ObservationAPIImpl - Firing update event for current user, originator: 59 and subject: TEST
19:17:22.572 [main] WARN net.anotheria.anoplass.api.generic.observation.ObservationAPIImpl - (Uncaught exception in observer: net.anotheria.anoplass.api.generic.observation.ObservationAPITest$2@290d210d .notifySubjectUpdatedForCurrentUser(S: TEST, O: 59, U: current, T: 1523467042572, D: Wed. 11.04.2018, 19:17)
java.lang.RuntimeException: foo
	at net.anotheria.anoplass.api.generic.observation.ObservationAPITest$2.notifySubjectUpdatedForCurrentUser(ObservationAPITest.java:71)
	at net.anotheria.anoplass.api.generic.observation.ObservationAPIImpl.fireSubjectUpdateForCurrentUser(ObservationAPIImpl.java:52)
	at sun.reflect.GeneratedMethodAccessor4.invoke(Unknown Source)
	at sun.reflect.DelegatingMethodAccessorImpl.invoke(DelegatingMethodAccessorImpl.java:43)
	at java.lang.reflect.Method.invoke(Method.java:498)
	at net.anotheria.moskito.core.predefined.ServiceStatsCallHandler.invoke(ServiceStatsCallHandler.java:102)
	at net.anotheria.moskito.core.dynamic.MoskitoInvokationProxy.invoke(MoskitoInvokationProxy.java:183)
	at com.sun.proxy.$Proxy16.fireSubjectUpdateForCurrentUser(Unknown Source)
	at sun.reflect.GeneratedMethodAccessor4.invoke(Unknown Source)
	at sun.reflect.DelegatingMethodAccessorImpl.invoke(DelegatingMethodAccessorImpl.java:43)
	at java.lang.reflect.Method.invoke(Method.java:498)
	at net.anotheria.anoplass.api.APICallHandler.invoke(APICallHandler.java:92)
	at com.sun.proxy.$Proxy16.fireSubjectUpdateForCurrentUser(Unknown Source)
	at net.anotheria.anoplass.api.generic.observation.ObservationAPITest.testErrorInObserver(ObservationAPITest.java:78)
	at sun.reflect.NativeMethodAccessorImpl.invoke0(Native Method)
	at sun.reflect.NativeMethodAccessorImpl.invoke(NativeMethodAccessorImpl.java:62)
	at sun.reflect.DelegatingMethodAccessorImpl.invoke(DelegatingMethodAccessorImpl.java:43)
	at java.lang.reflect.Method.invoke(Method.java:498)
	at org.junit.runners.model.FrameworkMethod$1.runReflectiveCall(FrameworkMethod.java:50)
	at org.junit.internal.runners.model.ReflectiveCallable.run(ReflectiveCallable.java:12)
	at org.junit.runners.model.FrameworkMethod.invokeExplosively(FrameworkMethod.java:47)
	at org.junit.internal.runners.statements.InvokeMethod.evaluate(InvokeMethod.java:17)
	at org.junit.internal.runners.statements.RunBefores.evaluate(RunBefores.java:26)
	at org.junit.runners.ParentRunner.runLeaf(ParentRunner.java:325)
	at org.junit.runners.BlockJUnit4ClassRunner.runChild(BlockJUnit4ClassRunner.java:78)
	at org.junit.runners.BlockJUnit4ClassRunner.runChild(BlockJUnit4ClassRunner.java:57)
	at org.junit.runners.ParentRunner$3.run(ParentRunner.java:290)
	at org.junit.runners.ParentRunner$1.schedule(ParentRunner.java:71)
	at org.junit.runners.ParentRunner.runChildren(ParentRunner.java:288)
	at org.junit.runners.ParentRunner.access$000(ParentRunner.java:58)
	at org.junit.runners.ParentRunner$2.evaluate(ParentRunner.java:268)
	at org.junit.runners.ParentRunner.run(ParentRunner.java:363)
	at org.apache.maven.surefire.junit4.JUnit4Provider.execute(JUnit4Provider.java:367)
	at org.apache.maven.surefire.junit4.JUnit4Provider.executeWithRerun(JUnit4Provider.java:274)
	at org.apache.maven.surefire.junit4.JUnit4Provider.executeTestSet(JUnit4Provider.java:238)
	at org.apache.maven.surefire.junit4.JUnit4Provider.invoke(JUnit4Provider.java:161)
	at org.apache.maven.surefire.booter.ForkedBooter.invokeProviderInSameClassLoader(ForkedBooter.java:290)
	at org.apache.maven.surefire.booter.ForkedBooter.runSuitesInProcess(ForkedBooter.java:242)
	at org.apache.maven.surefire.booter.ForkedBooter.main(ForkedBooter.java:121)
19:17:22.572 [main] DEBUG net.anotheria.anoplass.api.generic.observation.ObservationAPIImpl - Firing update event for user 60, originator: 60 and subject: TEST
19:17:22.572 [main] DEBUG net.anotheria.anoplass.api.generic.observation.ObservationAPIImpl - Firing update event for current user, originator: 61 and subject: TEST
19:17:22.573 [main] WARN net.anotheria.anoplass.api.generic.observation.ObservationAPIImpl - (Uncaught exception in observer: net.anotheria.anoplass.api.generic.observation.ObservationAPITest$2@290d210d .notifySubjectUpdatedForCurrentUser(S: TEST, O: 61, U: current, T: 1523467042573, D: Wed. 11.04.2018, 19:17)
java.lang.RuntimeException: foo
	at net.anotheria.anoplass.api.generic.observation.ObservationAPITest$2.notifySubjectUpdatedForCurrentUser(ObservationAPITest.java:71)
	at net.anotheria.anoplass.api.generic.observation.ObservationAPIImpl.fireSubjectUpdateForCurrentUser(ObservationAPIImpl.java:52)
	at sun.reflect.GeneratedMethodAccessor4.invoke(Unknown Source)
	at sun.reflect.DelegatingMethodAccessorImpl.invoke(DelegatingMethodAccessorImpl.java:43)
	at java.lang.reflect.Method.invoke(Method.java:498)
	at net.anotheria.moskito.core.predefined.ServiceStatsCallHandler.invoke(ServiceStatsCallHandler.java:102)
	at net.anotheria.moskito.core.dynamic.MoskitoInvokationProxy.invoke(MoskitoInvokationProxy.java:183)
	at com.sun.proxy.$Proxy16.fireSubjectUpdateForCurrentUser(Unknown Source)
	at sun.reflect.GeneratedMethodAccessor4.invoke(Unknown Source)
	at sun.reflect.DelegatingMethodAccessorImpl.invoke(DelegatingMethodAccessorImpl.java:43)
	at java.lang.reflect.Method.invoke(Method.java:498)
	at net.anotheria.anoplass.api.APICallHandler.invoke(APICallHandler.java:92)
	at com.sun.proxy.$Proxy16.fireSubjectUpdateForCurrentUser(Unknown Source)
	at net.anotheria.anoplass.api.generic.observation.ObservationAPITest.testErrorInObserver(ObservationAPITest.java:78)
	at sun.reflect.NativeMethodAccessorImpl.invoke0(Native Method)
	at sun.reflect.NativeMethodAccessorImpl.invoke(NativeMethodAccessorImpl.java:62)
	at sun.reflect.DelegatingMethodAccessorImpl.invoke(DelegatingMethodAccessorImpl.java:43)
	at java.lang.reflect.Method.invoke(Method.java:498)
	at org.junit.runners.model.FrameworkMethod$1.runReflectiveCall(FrameworkMethod.java:50)
	at org.junit.internal.runners.model.ReflectiveCallable.run(ReflectiveCallable.java:12)
	at org.junit.runners.model.FrameworkMethod.invokeExplosively(FrameworkMethod.java:47)
	at org.junit.internal.runners.statements.InvokeMethod.evaluate(InvokeMethod.java:17)
	at org.junit.internal.runners.statements.RunBefores.evaluate(RunBefores.java:26)
	at org.junit.runners.ParentRunner.runLeaf(ParentRunner.java:325)
	at org.junit.runners.BlockJUnit4ClassRunner.runChild(BlockJUnit4ClassRunner.java:78)
	at org.junit.runners.BlockJUnit4ClassRunner.runChild(BlockJUnit4ClassRunner.java:57)
	at org.junit.runners.ParentRunner$3.run(ParentRunner.java:290)
	at org.junit.runners.ParentRunner$1.schedule(ParentRunner.java:71)
	at org.junit.runners.ParentRunner.runChildren(ParentRunner.java:288)
	at org.junit.runners.ParentRunner.access$000(ParentRunner.java:58)
	at org.junit.runners.ParentRunner$2.evaluate(ParentRunner.java:268)
	at org.junit.runners.ParentRunner.run(ParentRunner.java:363)
	at org.apache.maven.surefire.junit4.JUnit4Provider.execute(JUnit4Provider.java:367)
	at org.apache.maven.surefire.junit4.JUnit4Provider.executeWithRerun(JUnit4Provider.java:274)
	at org.apache.maven.surefire.junit4.JUnit4Provider.executeTestSet(JUnit4Provider.java:238)
	at org.apache.maven.surefire.junit4.JUnit4Provider.invoke(JUnit4Provider.java:161)
	at org.apache.maven.surefire.booter.ForkedBooter.invokeProviderInSameClassLoader(ForkedBooter.java:290)
	at org.apache.maven.surefire.booter.ForkedBooter.runSuitesInProcess(ForkedBooter.java:242)
	at org.apache.maven.surefire.booter.ForkedBooter.main(ForkedBooter.java:121)
19:17:22.573 [main] DEBUG net.anotheria.anoplass.api.generic.observation.ObservationAPIImpl - Firing update event for user 62, originator: 62 and subject: TEST
19:17:22.573 [main] DEBUG net.anotheria.anoplass.api.generic.observation.ObservationAPIImpl - Firing update event for current user, originator: 63 and subject: TEST
19:17:22.574 [main] WARN net.anotheria.anoplass.api.generic.observation.ObservationAPIImpl - (Uncaught exception in observer: net.anotheria.anoplass.api.generic.observation.ObservationAPITest$2@290d210d .notifySubjectUpdatedForCurrentUser(S: TEST, O: 63, U: current, T: 1523467042573, D: Wed. 11.04.2018, 19:17)
java.lang.RuntimeException: foo
	at net.anotheria.anoplass.api.generic.observation.ObservationAPITest$2.notifySubjectUpdatedForCurrentUser(ObservationAPITest.java:71)
	at net.anotheria.anoplass.api.generic.observation.ObservationAPIImpl.fireSubjectUpdateForCurrentUser(ObservationAPIImpl.java:52)
	at sun.reflect.GeneratedMethodAccessor4.invoke(Unknown Source)
	at sun.reflect.DelegatingMethodAccessorImpl.invoke(DelegatingMethodAccessorImpl.java:43)
	at java.lang.reflect.Method.invoke(Method.java:498)
	at net.anotheria.moskito.core.predefined.ServiceStatsCallHandler.invoke(ServiceStatsCallHandler.java:102)
	at net.anotheria.moskito.core.dynamic.MoskitoInvokationProxy.invoke(MoskitoInvokationProxy.java:183)
	at com.sun.proxy.$Proxy16.fireSubjectUpdateForCurrentUser(Unknown Source)
	at sun.reflect.GeneratedMethodAccessor4.invoke(Unknown Source)
	at sun.reflect.DelegatingMethodAccessorImpl.invoke(DelegatingMethodAccessorImpl.java:43)
	at java.lang.reflect.Method.invoke(Method.java:498)
	at net.anotheria.anoplass.api.APICallHandler.invoke(APICallHandler.java:92)
	at com.sun.proxy.$Proxy16.fireSubjectUpdateForCurrentUser(Unknown Source)
	at net.anotheria.anoplass.api.generic.observation.ObservationAPITest.testErrorInObserver(ObservationAPITest.java:78)
	at sun.reflect.NativeMethodAccessorImpl.invoke0(Native Method)
	at sun.reflect.NativeMethodAccessorImpl.invoke(NativeMethodAccessorImpl.java:62)
	at sun.reflect.DelegatingMethodAccessorImpl.invoke(DelegatingMethodAccessorImpl.java:43)
	at java.lang.reflect.Method.invoke(Method.java:498)
	at org.junit.runners.model.FrameworkMethod$1.runReflectiveCall(FrameworkMethod.java:50)
	at org.junit.internal.runners.model.ReflectiveCallable.run(ReflectiveCallable.java:12)
	at org.junit.runners.model.FrameworkMethod.invokeExplosively(FrameworkMethod.java:47)
	at org.junit.internal.runners.statements.InvokeMethod.evaluate(InvokeMethod.java:17)
	at org.junit.internal.runners.statements.RunBefores.evaluate(RunBefores.java:26)
	at org.junit.runners.ParentRunner.runLeaf(ParentRunner.java:325)
	at org.junit.runners.BlockJUnit4ClassRunner.runChild(BlockJUnit4ClassRunner.java:78)
	at org.junit.runners.BlockJUnit4ClassRunner.runChild(BlockJUnit4ClassRunner.java:57)
	at org.junit.runners.ParentRunner$3.run(ParentRunner.java:290)
	at org.junit.runners.ParentRunner$1.schedule(ParentRunner.java:71)
	at org.junit.runners.ParentRunner.runChildren(ParentRunner.java:288)
	at org.junit.runners.ParentRunner.access$000(ParentRunner.java:58)
	at org.junit.runners.ParentRunner$2.evaluate(ParentRunner.java:268)
	at org.junit.runners.ParentRunner.run(ParentRunner.java:363)
	at org.apache.maven.surefire.junit4.JUnit4Provider.execute(JUnit4Provider.java:367)
	at org.apache.maven.surefire.junit4.JUnit4Provider.executeWithRerun(JUnit4Provider.java:274)
	at org.apache.maven.surefire.junit4.JUnit4Provider.executeTestSet(JUnit4Provider.java:238)
	at org.apache.maven.surefire.junit4.JUnit4Provider.invoke(JUnit4Provider.java:161)
	at org.apache.maven.surefire.booter.ForkedBooter.invokeProviderInSameClassLoader(ForkedBooter.java:290)
	at org.apache.maven.surefire.booter.ForkedBooter.runSuitesInProcess(ForkedBooter.java:242)
	at org.apache.maven.surefire.booter.ForkedBooter.main(ForkedBooter.java:121)
19:17:22.574 [main] DEBUG net.anotheria.anoplass.api.generic.observation.ObservationAPIImpl - Firing update event for user 64, originator: 64 and subject: TEST
19:17:22.574 [main] DEBUG net.anotheria.anoplass.api.generic.observation.ObservationAPIImpl - Firing update event for current user, originator: 65 and subject: TEST
19:17:22.575 [main] WARN net.anotheria.anoplass.api.generic.observation.ObservationAPIImpl - (Uncaught exception in observer: net.anotheria.anoplass.api.generic.observation.ObservationAPITest$2@290d210d .notifySubjectUpdatedForCurrentUser(S: TEST, O: 65, U: current, T: 1523467042575, D: Wed. 11.04.2018, 19:17)
java.lang.RuntimeException: foo
	at net.anotheria.anoplass.api.generic.observation.ObservationAPITest$2.notifySubjectUpdatedForCurrentUser(ObservationAPITest.java:71)
	at net.anotheria.anoplass.api.generic.observation.ObservationAPIImpl.fireSubjectUpdateForCurrentUser(ObservationAPIImpl.java:52)
	at sun.reflect.GeneratedMethodAccessor4.invoke(Unknown Source)
	at sun.reflect.DelegatingMethodAccessorImpl.invoke(DelegatingMethodAccessorImpl.java:43)
	at java.lang.reflect.Method.invoke(Method.java:498)
	at net.anotheria.moskito.core.predefined.ServiceStatsCallHandler.invoke(ServiceStatsCallHandler.java:102)
	at net.anotheria.moskito.core.dynamic.MoskitoInvokationProxy.invoke(MoskitoInvokationProxy.java:183)
	at com.sun.proxy.$Proxy16.fireSubjectUpdateForCurrentUser(Unknown Source)
	at sun.reflect.GeneratedMethodAccessor4.invoke(Unknown Source)
	at sun.reflect.DelegatingMethodAccessorImpl.invoke(DelegatingMethodAccessorImpl.java:43)
	at java.lang.reflect.Method.invoke(Method.java:498)
	at net.anotheria.anoplass.api.APICallHandler.invoke(APICallHandler.java:92)
	at com.sun.proxy.$Proxy16.fireSubjectUpdateForCurrentUser(Unknown Source)
	at net.anotheria.anoplass.api.generic.observation.ObservationAPITest.testErrorInObserver(ObservationAPITest.java:78)
	at sun.reflect.NativeMethodAccessorImpl.invoke0(Native Method)
	at sun.reflect.NativeMethodAccessorImpl.invoke(NativeMethodAccessorImpl.java:62)
	at sun.reflect.DelegatingMethodAccessorImpl.invoke(DelegatingMethodAccessorImpl.java:43)
	at java.lang.reflect.Method.invoke(Method.java:498)
	at org.junit.runners.model.FrameworkMethod$1.runReflectiveCall(FrameworkMethod.java:50)
	at org.junit.internal.runners.model.ReflectiveCallable.run(ReflectiveCallable.java:12)
	at org.junit.runners.model.FrameworkMethod.invokeExplosively(FrameworkMethod.java:47)
	at org.junit.internal.runners.statements.InvokeMethod.evaluate(InvokeMethod.java:17)
	at org.junit.internal.runners.statements.RunBefores.evaluate(RunBefores.java:26)
	at org.junit.runners.ParentRunner.runLeaf(ParentRunner.java:325)
	at org.junit.runners.BlockJUnit4ClassRunner.runChild(BlockJUnit4ClassRunner.java:78)
	at org.junit.runners.BlockJUnit4ClassRunner.runChild(BlockJUnit4ClassRunner.java:57)
	at org.junit.runners.ParentRunner$3.run(ParentRunner.java:290)
	at org.junit.runners.ParentRunner$1.schedule(ParentRunner.java:71)
	at org.junit.runners.ParentRunner.runChildren(ParentRunner.java:288)
	at org.junit.runners.ParentRunner.access$000(ParentRunner.java:58)
	at org.junit.runners.ParentRunner$2.evaluate(ParentRunner.java:268)
	at org.junit.runners.ParentRunner.run(ParentRunner.java:363)
	at org.apache.maven.surefire.junit4.JUnit4Provider.execute(JUnit4Provider.java:367)
	at org.apache.maven.surefire.junit4.JUnit4Provider.executeWithRerun(JUnit4Provider.java:274)
	at org.apache.maven.surefire.junit4.JUnit4Provider.executeTestSet(JUnit4Provider.java:238)
	at org.apache.maven.surefire.junit4.JUnit4Provider.invoke(JUnit4Provider.java:161)
	at org.apache.maven.surefire.booter.ForkedBooter.invokeProviderInSameClassLoader(ForkedBooter.java:290)
	at org.apache.maven.surefire.booter.ForkedBooter.runSuitesInProcess(ForkedBooter.java:242)
	at org.apache.maven.surefire.booter.ForkedBooter.main(ForkedBooter.java:121)
19:17:22.575 [main] DEBUG net.anotheria.anoplass.api.generic.observation.ObservationAPIImpl - Firing update event for user 66, originator: 66 and subject: TEST
19:17:22.576 [main] DEBUG net.anotheria.anoplass.api.generic.observation.ObservationAPIImpl - Firing update event for current user, originator: 67 and subject: TEST
19:17:22.576 [main] WARN net.anotheria.anoplass.api.generic.observation.ObservationAPIImpl - (Uncaught exception in observer: net.anotheria.anoplass.api.generic.observation.ObservationAPITest$2@290d210d .notifySubjectUpdatedForCurrentUser(S: TEST, O: 67, U: current, T: 1523467042576, D: Wed. 11.04.2018, 19:17)
java.lang.RuntimeException: foo
	at net.anotheria.anoplass.api.generic.observation.ObservationAPITest$2.notifySubjectUpdatedForCurrentUser(ObservationAPITest.java:71)
	at net.anotheria.anoplass.api.generic.observation.ObservationAPIImpl.fireSubjectUpdateForCurrentUser(ObservationAPIImpl.java:52)
	at sun.reflect.GeneratedMethodAccessor4.invoke(Unknown Source)
	at sun.reflect.DelegatingMethodAccessorImpl.invoke(DelegatingMethodAccessorImpl.java:43)
	at java.lang.reflect.Method.invoke(Method.java:498)
	at net.anotheria.moskito.core.predefined.ServiceStatsCallHandler.invoke(ServiceStatsCallHandler.java:102)
	at net.anotheria.moskito.core.dynamic.MoskitoInvokationProxy.invoke(MoskitoInvokationProxy.java:183)
	at com.sun.proxy.$Proxy16.fireSubjectUpdateForCurrentUser(Unknown Source)
	at sun.reflect.GeneratedMethodAccessor4.invoke(Unknown Source)
	at sun.reflect.DelegatingMethodAccessorImpl.invoke(DelegatingMethodAccessorImpl.java:43)
	at java.lang.reflect.Method.invoke(Method.java:498)
	at net.anotheria.anoplass.api.APICallHandler.invoke(APICallHandler.java:92)
	at com.sun.proxy.$Proxy16.fireSubjectUpdateForCurrentUser(Unknown Source)
	at net.anotheria.anoplass.api.generic.observation.ObservationAPITest.testErrorInObserver(ObservationAPITest.java:78)
	at sun.reflect.NativeMethodAccessorImpl.invoke0(Native Method)
	at sun.reflect.NativeMethodAccessorImpl.invoke(NativeMethodAccessorImpl.java:62)
	at sun.reflect.DelegatingMethodAccessorImpl.invoke(DelegatingMethodAccessorImpl.java:43)
	at java.lang.reflect.Method.invoke(Method.java:498)
	at org.junit.runners.model.FrameworkMethod$1.runReflectiveCall(FrameworkMethod.java:50)
	at org.junit.internal.runners.model.ReflectiveCallable.run(ReflectiveCallable.java:12)
	at org.junit.runners.model.FrameworkMethod.invokeExplosively(FrameworkMethod.java:47)
	at org.junit.internal.runners.statements.InvokeMethod.evaluate(InvokeMethod.java:17)
	at org.junit.internal.runners.statements.RunBefores.evaluate(RunBefores.java:26)
	at org.junit.runners.ParentRunner.runLeaf(ParentRunner.java:325)
	at org.junit.runners.BlockJUnit4ClassRunner.runChild(BlockJUnit4ClassRunner.java:78)
	at org.junit.runners.BlockJUnit4ClassRunner.runChild(BlockJUnit4ClassRunner.java:57)
	at org.junit.runners.ParentRunner$3.run(ParentRunner.java:290)
	at org.junit.runners.ParentRunner$1.schedule(ParentRunner.java:71)
	at org.junit.runners.ParentRunner.runChildren(ParentRunner.java:288)
	at org.junit.runners.ParentRunner.access$000(ParentRunner.java:58)
	at org.junit.runners.ParentRunner$2.evaluate(ParentRunner.java:268)
	at org.junit.runners.ParentRunner.run(ParentRunner.java:363)
	at org.apache.maven.surefire.junit4.JUnit4Provider.execute(JUnit4Provider.java:367)
	at org.apache.maven.surefire.junit4.JUnit4Provider.executeWithRerun(JUnit4Provider.java:274)
	at org.apache.maven.surefire.junit4.JUnit4Provider.executeTestSet(JUnit4Provider.java:238)
	at org.apache.maven.surefire.junit4.JUnit4Provider.invoke(JUnit4Provider.java:161)
	at org.apache.maven.surefire.booter.ForkedBooter.invokeProviderInSameClassLoader(ForkedBooter.java:290)
	at org.apache.maven.surefire.booter.ForkedBooter.runSuitesInProcess(ForkedBooter.java:242)
	at org.apache.maven.surefire.booter.ForkedBooter.main(ForkedBooter.java:121)
19:17:22.576 [main] DEBUG net.anotheria.anoplass.api.generic.observation.ObservationAPIImpl - Firing update event for user 68, originator: 68 and subject: TEST
19:17:22.576 [main] DEBUG net.anotheria.anoplass.api.generic.observation.ObservationAPIImpl - Firing update event for current user, originator: 69 and subject: TEST
19:17:22.577 [main] WARN net.anotheria.anoplass.api.generic.observation.ObservationAPIImpl - (Uncaught exception in observer: net.anotheria.anoplass.api.generic.observation.ObservationAPITest$2@290d210d .notifySubjectUpdatedForCurrentUser(S: TEST, O: 69, U: current, T: 1523467042577, D: Wed. 11.04.2018, 19:17)
java.lang.RuntimeException: foo
	at net.anotheria.anoplass.api.generic.observation.ObservationAPITest$2.notifySubjectUpdatedForCurrentUser(ObservationAPITest.java:71)
	at net.anotheria.anoplass.api.generic.observation.ObservationAPIImpl.fireSubjectUpdateForCurrentUser(ObservationAPIImpl.java:52)
	at sun.reflect.GeneratedMethodAccessor4.invoke(Unknown Source)
	at sun.reflect.DelegatingMethodAccessorImpl.invoke(DelegatingMethodAccessorImpl.java:43)
	at java.lang.reflect.Method.invoke(Method.java:498)
	at net.anotheria.moskito.core.predefined.ServiceStatsCallHandler.invoke(ServiceStatsCallHandler.java:102)
	at net.anotheria.moskito.core.dynamic.MoskitoInvokationProxy.invoke(MoskitoInvokationProxy.java:183)
	at com.sun.proxy.$Proxy16.fireSubjectUpdateForCurrentUser(Unknown Source)
	at sun.reflect.GeneratedMethodAccessor4.invoke(Unknown Source)
	at sun.reflect.DelegatingMethodAccessorImpl.invoke(DelegatingMethodAccessorImpl.java:43)
	at java.lang.reflect.Method.invoke(Method.java:498)
	at net.anotheria.anoplass.api.APICallHandler.invoke(APICallHandler.java:92)
	at com.sun.proxy.$Proxy16.fireSubjectUpdateForCurrentUser(Unknown Source)
	at net.anotheria.anoplass.api.generic.observation.ObservationAPITest.testErrorInObserver(ObservationAPITest.java:78)
	at sun.reflect.NativeMethodAccessorImpl.invoke0(Native Method)
	at sun.reflect.NativeMethodAccessorImpl.invoke(NativeMethodAccessorImpl.java:62)
	at sun.reflect.DelegatingMethodAccessorImpl.invoke(DelegatingMethodAccessorImpl.java:43)
	at java.lang.reflect.Method.invoke(Method.java:498)
	at org.junit.runners.model.FrameworkMethod$1.runReflectiveCall(FrameworkMethod.java:50)
	at org.junit.internal.runners.model.ReflectiveCallable.run(ReflectiveCallable.java:12)
	at org.junit.runners.model.FrameworkMethod.invokeExplosively(FrameworkMethod.java:47)
	at org.junit.internal.runners.statements.InvokeMethod.evaluate(InvokeMethod.java:17)
	at org.junit.internal.runners.statements.RunBefores.evaluate(RunBefores.java:26)
	at org.junit.runners.ParentRunner.runLeaf(ParentRunner.java:325)
	at org.junit.runners.BlockJUnit4ClassRunner.runChild(BlockJUnit4ClassRunner.java:78)
	at org.junit.runners.BlockJUnit4ClassRunner.runChild(BlockJUnit4ClassRunner.java:57)
	at org.junit.runners.ParentRunner$3.run(ParentRunner.java:290)
	at org.junit.runners.ParentRunner$1.schedule(ParentRunner.java:71)
	at org.junit.runners.ParentRunner.runChildren(ParentRunner.java:288)
	at org.junit.runners.ParentRunner.access$000(ParentRunner.java:58)
	at org.junit.runners.ParentRunner$2.evaluate(ParentRunner.java:268)
	at org.junit.runners.ParentRunner.run(ParentRunner.java:363)
	at org.apache.maven.surefire.junit4.JUnit4Provider.execute(JUnit4Provider.java:367)
	at org.apache.maven.surefire.junit4.JUnit4Provider.executeWithRerun(JUnit4Provider.java:274)
	at org.apache.maven.surefire.junit4.JUnit4Provider.executeTestSet(JUnit4Provider.java:238)
	at org.apache.maven.surefire.junit4.JUnit4Provider.invoke(JUnit4Provider.java:161)
	at org.apache.maven.surefire.booter.ForkedBooter.invokeProviderInSameClassLoader(ForkedBooter.java:290)
	at org.apache.maven.surefire.booter.ForkedBooter.runSuitesInProcess(ForkedBooter.java:242)
	at org.apache.maven.surefire.booter.ForkedBooter.main(ForkedBooter.java:121)
19:17:22.577 [main] DEBUG net.anotheria.anoplass.api.generic.observation.ObservationAPIImpl - Firing update event for user 70, originator: 70 and subject: TEST
19:17:22.577 [main] DEBUG net.anotheria.anoplass.api.generic.observation.ObservationAPIImpl - Firing update event for current user, originator: 71 and subject: TEST
19:17:22.578 [main] WARN net.anotheria.anoplass.api.generic.observation.ObservationAPIImpl - (Uncaught exception in observer: net.anotheria.anoplass.api.generic.observation.ObservationAPITest$2@290d210d .notifySubjectUpdatedForCurrentUser(S: TEST, O: 71, U: current, T: 1523467042577, D: Wed. 11.04.2018, 19:17)
java.lang.RuntimeException: foo
	at net.anotheria.anoplass.api.generic.observation.ObservationAPITest$2.notifySubjectUpdatedForCurrentUser(ObservationAPITest.java:71)
	at net.anotheria.anoplass.api.generic.observation.ObservationAPIImpl.fireSubjectUpdateForCurrentUser(ObservationAPIImpl.java:52)
	at sun.reflect.GeneratedMethodAccessor4.invoke(Unknown Source)
	at sun.reflect.DelegatingMethodAccessorImpl.invoke(DelegatingMethodAccessorImpl.java:43)
	at java.lang.reflect.Method.invoke(Method.java:498)
	at net.anotheria.moskito.core.predefined.ServiceStatsCallHandler.invoke(ServiceStatsCallHandler.java:102)
	at net.anotheria.moskito.core.dynamic.MoskitoInvokationProxy.invoke(MoskitoInvokationProxy.java:183)
	at com.sun.proxy.$Proxy16.fireSubjectUpdateForCurrentUser(Unknown Source)
	at sun.reflect.GeneratedMethodAccessor4.invoke(Unknown Source)
	at sun.reflect.DelegatingMethodAccessorImpl.invoke(DelegatingMethodAccessorImpl.java:43)
	at java.lang.reflect.Method.invoke(Method.java:498)
	at net.anotheria.anoplass.api.APICallHandler.invoke(APICallHandler.java:92)
	at com.sun.proxy.$Proxy16.fireSubjectUpdateForCurrentUser(Unknown Source)
	at net.anotheria.anoplass.api.generic.observation.ObservationAPITest.testErrorInObserver(ObservationAPITest.java:78)
	at sun.reflect.NativeMethodAccessorImpl.invoke0(Native Method)
	at sun.reflect.NativeMethodAccessorImpl.invoke(NativeMethodAccessorImpl.java:62)
	at sun.reflect.DelegatingMethodAccessorImpl.invoke(DelegatingMethodAccessorImpl.java:43)
	at java.lang.reflect.Method.invoke(Method.java:498)
	at org.junit.runners.model.FrameworkMethod$1.runReflectiveCall(FrameworkMethod.java:50)
	at org.junit.internal.runners.model.ReflectiveCallable.run(ReflectiveCallable.java:12)
	at org.junit.runners.model.FrameworkMethod.invokeExplosively(FrameworkMethod.java:47)
	at org.junit.internal.runners.statements.InvokeMethod.evaluate(InvokeMethod.java:17)
	at org.junit.internal.runners.statements.RunBefores.evaluate(RunBefores.java:26)
	at org.junit.runners.ParentRunner.runLeaf(ParentRunner.java:325)
	at org.junit.runners.BlockJUnit4ClassRunner.runChild(BlockJUnit4ClassRunner.java:78)
	at org.junit.runners.BlockJUnit4ClassRunner.runChild(BlockJUnit4ClassRunner.java:57)
	at org.junit.runners.ParentRunner$3.run(ParentRunner.java:290)
	at org.junit.runners.ParentRunner$1.schedule(ParentRunner.java:71)
	at org.junit.runners.ParentRunner.runChildren(ParentRunner.java:288)
	at org.junit.runners.ParentRunner.access$000(ParentRunner.java:58)
	at org.junit.runners.ParentRunner$2.evaluate(ParentRunner.java:268)
	at org.junit.runners.ParentRunner.run(ParentRunner.java:363)
	at org.apache.maven.surefire.junit4.JUnit4Provider.execute(JUnit4Provider.java:367)
	at org.apache.maven.surefire.junit4.JUnit4Provider.executeWithRerun(JUnit4Provider.java:274)
	at org.apache.maven.surefire.junit4.JUnit4Provider.executeTestSet(JUnit4Provider.java:238)
	at org.apache.maven.surefire.junit4.JUnit4Provider.invoke(JUnit4Provider.java:161)
	at org.apache.maven.surefire.booter.ForkedBooter.invokeProviderInSameClassLoader(ForkedBooter.java:290)
	at org.apache.maven.surefire.booter.ForkedBooter.runSuitesInProcess(ForkedBooter.java:242)
	at org.apache.maven.surefire.booter.ForkedBooter.main(ForkedBooter.java:121)
19:17:22.578 [main] DEBUG net.anotheria.anoplass.api.generic.observation.ObservationAPIImpl - Firing update event for user 72, originator: 72 and subject: TEST
19:17:22.578 [main] DEBUG net.anotheria.anoplass.api.generic.observation.ObservationAPIImpl - Firing update event for current user, originator: 73 and subject: TEST
19:17:22.579 [main] WARN net.anotheria.anoplass.api.generic.observation.ObservationAPIImpl - (Uncaught exception in observer: net.anotheria.anoplass.api.generic.observation.ObservationAPITest$2@290d210d .notifySubjectUpdatedForCurrentUser(S: TEST, O: 73, U: current, T: 1523467042578, D: Wed. 11.04.2018, 19:17)
java.lang.RuntimeException: foo
	at net.anotheria.anoplass.api.generic.observation.ObservationAPITest$2.notifySubjectUpdatedForCurrentUser(ObservationAPITest.java:71)
	at net.anotheria.anoplass.api.generic.observation.ObservationAPIImpl.fireSubjectUpdateForCurrentUser(ObservationAPIImpl.java:52)
	at sun.reflect.GeneratedMethodAccessor4.invoke(Unknown Source)
	at sun.reflect.DelegatingMethodAccessorImpl.invoke(DelegatingMethodAccessorImpl.java:43)
	at java.lang.reflect.Method.invoke(Method.java:498)
	at net.anotheria.moskito.core.predefined.ServiceStatsCallHandler.invoke(ServiceStatsCallHandler.java:102)
	at net.anotheria.moskito.core.dynamic.MoskitoInvokationProxy.invoke(MoskitoInvokationProxy.java:183)
	at com.sun.proxy.$Proxy16.fireSubjectUpdateForCurrentUser(Unknown Source)
	at sun.reflect.GeneratedMethodAccessor4.invoke(Unknown Source)
	at sun.reflect.DelegatingMethodAccessorImpl.invoke(DelegatingMethodAccessorImpl.java:43)
	at java.lang.reflect.Method.invoke(Method.java:498)
	at net.anotheria.anoplass.api.APICallHandler.invoke(APICallHandler.java:92)
	at com.sun.proxy.$Proxy16.fireSubjectUpdateForCurrentUser(Unknown Source)
	at net.anotheria.anoplass.api.generic.observation.ObservationAPITest.testErrorInObserver(ObservationAPITest.java:78)
	at sun.reflect.NativeMethodAccessorImpl.invoke0(Native Method)
	at sun.reflect.NativeMethodAccessorImpl.invoke(NativeMethodAccessorImpl.java:62)
	at sun.reflect.DelegatingMethodAccessorImpl.invoke(DelegatingMethodAccessorImpl.java:43)
	at java.lang.reflect.Method.invoke(Method.java:498)
	at org.junit.runners.model.FrameworkMethod$1.runReflectiveCall(FrameworkMethod.java:50)
	at org.junit.internal.runners.model.ReflectiveCallable.run(ReflectiveCallable.java:12)
	at org.junit.runners.model.FrameworkMethod.invokeExplosively(FrameworkMethod.java:47)
	at org.junit.internal.runners.statements.InvokeMethod.evaluate(InvokeMethod.java:17)
	at org.junit.internal.runners.statements.RunBefores.evaluate(RunBefores.java:26)
	at org.junit.runners.ParentRunner.runLeaf(ParentRunner.java:325)
	at org.junit.runners.BlockJUnit4ClassRunner.runChild(BlockJUnit4ClassRunner.java:78)
	at org.junit.runners.BlockJUnit4ClassRunner.runChild(BlockJUnit4ClassRunner.java:57)
	at org.junit.runners.ParentRunner$3.run(ParentRunner.java:290)
	at org.junit.runners.ParentRunner$1.schedule(ParentRunner.java:71)
	at org.junit.runners.ParentRunner.runChildren(ParentRunner.java:288)
	at org.junit.runners.ParentRunner.access$000(ParentRunner.java:58)
	at org.junit.runners.ParentRunner$2.evaluate(ParentRunner.java:268)
	at org.junit.runners.ParentRunner.run(ParentRunner.java:363)
	at org.apache.maven.surefire.junit4.JUnit4Provider.execute(JUnit4Provider.java:367)
	at org.apache.maven.surefire.junit4.JUnit4Provider.executeWithRerun(JUnit4Provider.java:274)
	at org.apache.maven.surefire.junit4.JUnit4Provider.executeTestSet(JUnit4Provider.java:238)
	at org.apache.maven.surefire.junit4.JUnit4Provider.invoke(JUnit4Provider.java:161)
	at org.apache.maven.surefire.booter.ForkedBooter.invokeProviderInSameClassLoader(ForkedBooter.java:290)
	at org.apache.maven.surefire.booter.ForkedBooter.runSuitesInProcess(ForkedBooter.java:242)
	at org.apache.maven.surefire.booter.ForkedBooter.main(ForkedBooter.java:121)
19:17:22.579 [main] DEBUG net.anotheria.anoplass.api.generic.observation.ObservationAPIImpl - Firing update event for user 74, originator: 74 and subject: TEST
19:17:22.579 [main] DEBUG net.anotheria.anoplass.api.generic.observation.ObservationAPIImpl - Firing update event for current user, originator: 75 and subject: TEST
19:17:22.580 [main] WARN net.anotheria.anoplass.api.generic.observation.ObservationAPIImpl - (Uncaught exception in observer: net.anotheria.anoplass.api.generic.observation.ObservationAPITest$2@290d210d .notifySubjectUpdatedForCurrentUser(S: TEST, O: 75, U: current, T: 1523467042579, D: Wed. 11.04.2018, 19:17)
java.lang.RuntimeException: foo
	at net.anotheria.anoplass.api.generic.observation.ObservationAPITest$2.notifySubjectUpdatedForCurrentUser(ObservationAPITest.java:71)
	at net.anotheria.anoplass.api.generic.observation.ObservationAPIImpl.fireSubjectUpdateForCurrentUser(ObservationAPIImpl.java:52)
	at sun.reflect.GeneratedMethodAccessor4.invoke(Unknown Source)
	at sun.reflect.DelegatingMethodAccessorImpl.invoke(DelegatingMethodAccessorImpl.java:43)
	at java.lang.reflect.Method.invoke(Method.java:498)
	at net.anotheria.moskito.core.predefined.ServiceStatsCallHandler.invoke(ServiceStatsCallHandler.java:102)
	at net.anotheria.moskito.core.dynamic.MoskitoInvokationProxy.invoke(MoskitoInvokationProxy.java:183)
	at com.sun.proxy.$Proxy16.fireSubjectUpdateForCurrentUser(Unknown Source)
	at sun.reflect.GeneratedMethodAccessor4.invoke(Unknown Source)
	at sun.reflect.DelegatingMethodAccessorImpl.invoke(DelegatingMethodAccessorImpl.java:43)
	at java.lang.reflect.Method.invoke(Method.java:498)
	at net.anotheria.anoplass.api.APICallHandler.invoke(APICallHandler.java:92)
	at com.sun.proxy.$Proxy16.fireSubjectUpdateForCurrentUser(Unknown Source)
	at net.anotheria.anoplass.api.generic.observation.ObservationAPITest.testErrorInObserver(ObservationAPITest.java:78)
	at sun.reflect.NativeMethodAccessorImpl.invoke0(Native Method)
	at sun.reflect.NativeMethodAccessorImpl.invoke(NativeMethodAccessorImpl.java:62)
	at sun.reflect.DelegatingMethodAccessorImpl.invoke(DelegatingMethodAccessorImpl.java:43)
	at java.lang.reflect.Method.invoke(Method.java:498)
	at org.junit.runners.model.FrameworkMethod$1.runReflectiveCall(FrameworkMethod.java:50)
	at org.junit.internal.runners.model.ReflectiveCallable.run(ReflectiveCallable.java:12)
	at org.junit.runners.model.FrameworkMethod.invokeExplosively(FrameworkMethod.java:47)
	at org.junit.internal.runners.statements.InvokeMethod.evaluate(InvokeMethod.java:17)
	at org.junit.internal.runners.statements.RunBefores.evaluate(RunBefores.java:26)
	at org.junit.runners.ParentRunner.runLeaf(ParentRunner.java:325)
	at org.junit.runners.BlockJUnit4ClassRunner.runChild(BlockJUnit4ClassRunner.java:78)
	at org.junit.runners.BlockJUnit4ClassRunner.runChild(BlockJUnit4ClassRunner.java:57)
	at org.junit.runners.ParentRunner$3.run(ParentRunner.java:290)
	at org.junit.runners.ParentRunner$1.schedule(ParentRunner.java:71)
	at org.junit.runners.ParentRunner.runChildren(ParentRunner.java:288)
	at org.junit.runners.ParentRunner.access$000(ParentRunner.java:58)
	at org.junit.runners.ParentRunner$2.evaluate(ParentRunner.java:268)
	at org.junit.runners.ParentRunner.run(ParentRunner.java:363)
	at org.apache.maven.surefire.junit4.JUnit4Provider.execute(JUnit4Provider.java:367)
	at org.apache.maven.surefire.junit4.JUnit4Provider.executeWithRerun(JUnit4Provider.java:274)
	at org.apache.maven.surefire.junit4.JUnit4Provider.executeTestSet(JUnit4Provider.java:238)
	at org.apache.maven.surefire.junit4.JUnit4Provider.invoke(JUnit4Provider.java:161)
	at org.apache.maven.surefire.booter.ForkedBooter.invokeProviderInSameClassLoader(ForkedBooter.java:290)
	at org.apache.maven.surefire.booter.ForkedBooter.runSuitesInProcess(ForkedBooter.java:242)
	at org.apache.maven.surefire.booter.ForkedBooter.main(ForkedBooter.java:121)
19:17:22.580 [main] DEBUG net.anotheria.anoplass.api.generic.observation.ObservationAPIImpl - Firing update event for user 76, originator: 76 and subject: TEST
19:17:22.580 [main] DEBUG net.anotheria.anoplass.api.generic.observation.ObservationAPIImpl - Firing update event for current user, originator: 77 and subject: TEST
19:17:22.580 [main] WARN net.anotheria.anoplass.api.generic.observation.ObservationAPIImpl - (Uncaught exception in observer: net.anotheria.anoplass.api.generic.observation.ObservationAPITest$2@290d210d .notifySubjectUpdatedForCurrentUser(S: TEST, O: 77, U: current, T: 1523467042580, D: Wed. 11.04.2018, 19:17)
java.lang.RuntimeException: foo
	at net.anotheria.anoplass.api.generic.observation.ObservationAPITest$2.notifySubjectUpdatedForCurrentUser(ObservationAPITest.java:71)
	at net.anotheria.anoplass.api.generic.observation.ObservationAPIImpl.fireSubjectUpdateForCurrentUser(ObservationAPIImpl.java:52)
	at sun.reflect.GeneratedMethodAccessor4.invoke(Unknown Source)
	at sun.reflect.DelegatingMethodAccessorImpl.invoke(DelegatingMethodAccessorImpl.java:43)
	at java.lang.reflect.Method.invoke(Method.java:498)
	at net.anotheria.moskito.core.predefined.ServiceStatsCallHandler.invoke(ServiceStatsCallHandler.java:102)
	at net.anotheria.moskito.core.dynamic.MoskitoInvokationProxy.invoke(MoskitoInvokationProxy.java:183)
	at com.sun.proxy.$Proxy16.fireSubjectUpdateForCurrentUser(Unknown Source)
	at sun.reflect.GeneratedMethodAccessor4.invoke(Unknown Source)
	at sun.reflect.DelegatingMethodAccessorImpl.invoke(DelegatingMethodAccessorImpl.java:43)
	at java.lang.reflect.Method.invoke(Method.java:498)
	at net.anotheria.anoplass.api.APICallHandler.invoke(APICallHandler.java:92)
	at com.sun.proxy.$Proxy16.fireSubjectUpdateForCurrentUser(Unknown Source)
	at net.anotheria.anoplass.api.generic.observation.ObservationAPITest.testErrorInObserver(ObservationAPITest.java:78)
	at sun.reflect.NativeMethodAccessorImpl.invoke0(Native Method)
	at sun.reflect.NativeMethodAccessorImpl.invoke(NativeMethodAccessorImpl.java:62)
	at sun.reflect.DelegatingMethodAccessorImpl.invoke(DelegatingMethodAccessorImpl.java:43)
	at java.lang.reflect.Method.invoke(Method.java:498)
	at org.junit.runners.model.FrameworkMethod$1.runReflectiveCall(FrameworkMethod.java:50)
	at org.junit.internal.runners.model.ReflectiveCallable.run(ReflectiveCallable.java:12)
	at org.junit.runners.model.FrameworkMethod.invokeExplosively(FrameworkMethod.java:47)
	at org.junit.internal.runners.statements.InvokeMethod.evaluate(InvokeMethod.java:17)
	at org.junit.internal.runners.statements.RunBefores.evaluate(RunBefores.java:26)
	at org.junit.runners.ParentRunner.runLeaf(ParentRunner.java:325)
	at org.junit.runners.BlockJUnit4ClassRunner.runChild(BlockJUnit4ClassRunner.java:78)
	at org.junit.runners.BlockJUnit4ClassRunner.runChild(BlockJUnit4ClassRunner.java:57)
	at org.junit.runners.ParentRunner$3.run(ParentRunner.java:290)
	at org.junit.runners.ParentRunner$1.schedule(ParentRunner.java:71)
	at org.junit.runners.ParentRunner.runChildren(ParentRunner.java:288)
	at org.junit.runners.ParentRunner.access$000(ParentRunner.java:58)
	at org.junit.runners.ParentRunner$2.evaluate(ParentRunner.java:268)
	at org.junit.runners.ParentRunner.run(ParentRunner.java:363)
	at org.apache.maven.surefire.junit4.JUnit4Provider.execute(JUnit4Provider.java:367)
	at org.apache.maven.surefire.junit4.JUnit4Provider.executeWithRerun(JUnit4Provider.java:274)
	at org.apache.maven.surefire.junit4.JUnit4Provider.executeTestSet(JUnit4Provider.java:238)
	at org.apache.maven.surefire.junit4.JUnit4Provider.invoke(JUnit4Provider.java:161)
	at org.apache.maven.surefire.booter.ForkedBooter.invokeProviderInSameClassLoader(ForkedBooter.java:290)
	at org.apache.maven.surefire.booter.ForkedBooter.runSuitesInProcess(ForkedBooter.java:242)
	at org.apache.maven.surefire.booter.ForkedBooter.main(ForkedBooter.java:121)
19:17:22.580 [main] DEBUG net.anotheria.anoplass.api.generic.observation.ObservationAPIImpl - Firing update event for user 78, originator: 78 and subject: TEST
19:17:22.580 [main] DEBUG net.anotheria.anoplass.api.generic.observation.ObservationAPIImpl - Firing update event for current user, originator: 79 and subject: TEST
19:17:22.580 [main] WARN net.anotheria.anoplass.api.generic.observation.ObservationAPIImpl - (Uncaught exception in observer: net.anotheria.anoplass.api.generic.observation.ObservationAPITest$2@290d210d .notifySubjectUpdatedForCurrentUser(S: TEST, O: 79, U: current, T: 1523467042580, D: Wed. 11.04.2018, 19:17)
java.lang.RuntimeException: foo
	at net.anotheria.anoplass.api.generic.observation.ObservationAPITest$2.notifySubjectUpdatedForCurrentUser(ObservationAPITest.java:71)
	at net.anotheria.anoplass.api.generic.observation.ObservationAPIImpl.fireSubjectUpdateForCurrentUser(ObservationAPIImpl.java:52)
	at sun.reflect.GeneratedMethodAccessor4.invoke(Unknown Source)
	at sun.reflect.DelegatingMethodAccessorImpl.invoke(DelegatingMethodAccessorImpl.java:43)
	at java.lang.reflect.Method.invoke(Method.java:498)
	at net.anotheria.moskito.core.predefined.ServiceStatsCallHandler.invoke(ServiceStatsCallHandler.java:102)
	at net.anotheria.moskito.core.dynamic.MoskitoInvokationProxy.invoke(MoskitoInvokationProxy.java:183)
	at com.sun.proxy.$Proxy16.fireSubjectUpdateForCurrentUser(Unknown Source)
	at sun.reflect.GeneratedMethodAccessor4.invoke(Unknown Source)
	at sun.reflect.DelegatingMethodAccessorImpl.invoke(DelegatingMethodAccessorImpl.java:43)
	at java.lang.reflect.Method.invoke(Method.java:498)
	at net.anotheria.anoplass.api.APICallHandler.invoke(APICallHandler.java:92)
	at com.sun.proxy.$Proxy16.fireSubjectUpdateForCurrentUser(Unknown Source)
	at net.anotheria.anoplass.api.generic.observation.ObservationAPITest.testErrorInObserver(ObservationAPITest.java:78)
	at sun.reflect.NativeMethodAccessorImpl.invoke0(Native Method)
	at sun.reflect.NativeMethodAccessorImpl.invoke(NativeMethodAccessorImpl.java:62)
	at sun.reflect.DelegatingMethodAccessorImpl.invoke(DelegatingMethodAccessorImpl.java:43)
	at java.lang.reflect.Method.invoke(Method.java:498)
	at org.junit.runners.model.FrameworkMethod$1.runReflectiveCall(FrameworkMethod.java:50)
	at org.junit.internal.runners.model.ReflectiveCallable.run(ReflectiveCallable.java:12)
	at org.junit.runners.model.FrameworkMethod.invokeExplosively(FrameworkMethod.java:47)
	at org.junit.internal.runners.statements.InvokeMethod.evaluate(InvokeMethod.java:17)
	at org.junit.internal.runners.statements.RunBefores.evaluate(RunBefores.java:26)
	at org.junit.runners.ParentRunner.runLeaf(ParentRunner.java:325)
	at org.junit.runners.BlockJUnit4ClassRunner.runChild(BlockJUnit4ClassRunner.java:78)
	at org.junit.runners.BlockJUnit4ClassRunner.runChild(BlockJUnit4ClassRunner.java:57)
	at org.junit.runners.ParentRunner$3.run(ParentRunner.java:290)
	at org.junit.runners.ParentRunner$1.schedule(ParentRunner.java:71)
	at org.junit.runners.ParentRunner.runChildren(ParentRunner.java:288)
	at org.junit.runners.ParentRunner.access$000(ParentRunner.java:58)
	at org.junit.runners.ParentRunner$2.evaluate(ParentRunner.java:268)
	at org.junit.runners.ParentRunner.run(ParentRunner.java:363)
	at org.apache.maven.surefire.junit4.JUnit4Provider.execute(JUnit4Provider.java:367)
	at org.apache.maven.surefire.junit4.JUnit4Provider.executeWithRerun(JUnit4Provider.java:274)
	at org.apache.maven.surefire.junit4.JUnit4Provider.executeTestSet(JUnit4Provider.java:238)
	at org.apache.maven.surefire.junit4.JUnit4Provider.invoke(JUnit4Provider.java:161)
	at org.apache.maven.surefire.booter.ForkedBooter.invokeProviderInSameClassLoader(ForkedBooter.java:290)
	at org.apache.maven.surefire.booter.ForkedBooter.runSuitesInProcess(ForkedBooter.java:242)
	at org.apache.maven.surefire.booter.ForkedBooter.main(ForkedBooter.java:121)
19:17:22.580 [main] DEBUG net.anotheria.anoplass.api.generic.observation.ObservationAPIImpl - Firing update event for user 80, originator: 80 and subject: TEST
19:17:22.580 [main] DEBUG net.anotheria.anoplass.api.generic.observation.ObservationAPIImpl - Firing update event for current user, originator: 81 and subject: TEST
19:17:22.580 [main] WARN net.anotheria.anoplass.api.generic.observation.ObservationAPIImpl - (Uncaught exception in observer: net.anotheria.anoplass.api.generic.observation.ObservationAPITest$2@290d210d .notifySubjectUpdatedForCurrentUser(S: TEST, O: 81, U: current, T: 1523467042580, D: Wed. 11.04.2018, 19:17)
java.lang.RuntimeException: foo
	at net.anotheria.anoplass.api.generic.observation.ObservationAPITest$2.notifySubjectUpdatedForCurrentUser(ObservationAPITest.java:71)
	at net.anotheria.anoplass.api.generic.observation.ObservationAPIImpl.fireSubjectUpdateForCurrentUser(ObservationAPIImpl.java:52)
	at sun.reflect.GeneratedMethodAccessor4.invoke(Unknown Source)
	at sun.reflect.DelegatingMethodAccessorImpl.invoke(DelegatingMethodAccessorImpl.java:43)
	at java.lang.reflect.Method.invoke(Method.java:498)
	at net.anotheria.moskito.core.predefined.ServiceStatsCallHandler.invoke(ServiceStatsCallHandler.java:102)
	at net.anotheria.moskito.core.dynamic.MoskitoInvokationProxy.invoke(MoskitoInvokationProxy.java:183)
	at com.sun.proxy.$Proxy16.fireSubjectUpdateForCurrentUser(Unknown Source)
	at sun.reflect.GeneratedMethodAccessor4.invoke(Unknown Source)
	at sun.reflect.DelegatingMethodAccessorImpl.invoke(DelegatingMethodAccessorImpl.java:43)
	at java.lang.reflect.Method.invoke(Method.java:498)
	at net.anotheria.anoplass.api.APICallHandler.invoke(APICallHandler.java:92)
	at com.sun.proxy.$Proxy16.fireSubjectUpdateForCurrentUser(Unknown Source)
	at net.anotheria.anoplass.api.generic.observation.ObservationAPITest.testErrorInObserver(ObservationAPITest.java:78)
	at sun.reflect.NativeMethodAccessorImpl.invoke0(Native Method)
	at sun.reflect.NativeMethodAccessorImpl.invoke(NativeMethodAccessorImpl.java:62)
	at sun.reflect.DelegatingMethodAccessorImpl.invoke(DelegatingMethodAccessorImpl.java:43)
	at java.lang.reflect.Method.invoke(Method.java:498)
	at org.junit.runners.model.FrameworkMethod$1.runReflectiveCall(FrameworkMethod.java:50)
	at org.junit.internal.runners.model.ReflectiveCallable.run(ReflectiveCallable.java:12)
	at org.junit.runners.model.FrameworkMethod.invokeExplosively(FrameworkMethod.java:47)
	at org.junit.internal.runners.statements.InvokeMethod.evaluate(InvokeMethod.java:17)
	at org.junit.internal.runners.statements.RunBefores.evaluate(RunBefores.java:26)
	at org.junit.runners.ParentRunner.runLeaf(ParentRunner.java:325)
	at org.junit.runners.BlockJUnit4ClassRunner.runChild(BlockJUnit4ClassRunner.java:78)
	at org.junit.runners.BlockJUnit4ClassRunner.runChild(BlockJUnit4ClassRunner.java:57)
	at org.junit.runners.ParentRunner$3.run(ParentRunner.java:290)
	at org.junit.runners.ParentRunner$1.schedule(ParentRunner.java:71)
	at org.junit.runners.ParentRunner.runChildren(ParentRunner.java:288)
	at org.junit.runners.ParentRunner.access$000(ParentRunner.java:58)
	at org.junit.runners.ParentRunner$2.evaluate(ParentRunner.java:268)
	at org.junit.runners.ParentRunner.run(ParentRunner.java:363)
	at org.apache.maven.surefire.junit4.JUnit4Provider.execute(JUnit4Provider.java:367)
	at org.apache.maven.surefire.junit4.JUnit4Provider.executeWithRerun(JUnit4Provider.java:274)
	at org.apache.maven.surefire.junit4.JUnit4Provider.executeTestSet(JUnit4Provider.java:238)
	at org.apache.maven.surefire.junit4.JUnit4Provider.invoke(JUnit4Provider.java:161)
	at org.apache.maven.surefire.booter.ForkedBooter.invokeProviderInSameClassLoader(ForkedBooter.java:290)
	at org.apache.maven.surefire.booter.ForkedBooter.runSuitesInProcess(ForkedBooter.java:242)
	at org.apache.maven.surefire.booter.ForkedBooter.main(ForkedBooter.java:121)
19:17:22.582 [main] DEBUG net.anotheria.anoplass.api.generic.observation.ObservationAPIImpl - Firing update event for user 82, originator: 82 and subject: TEST
19:17:22.585 [main] DEBUG net.anotheria.anoplass.api.generic.observation.ObservationAPIImpl - Firing update event for current user, originator: 83 and subject: TEST
19:17:22.586 [main] WARN net.anotheria.anoplass.api.generic.observation.ObservationAPIImpl - (Uncaught exception in observer: net.anotheria.anoplass.api.generic.observation.ObservationAPITest$2@290d210d .notifySubjectUpdatedForCurrentUser(S: TEST, O: 83, U: current, T: 1523467042585, D: Wed. 11.04.2018, 19:17)
java.lang.RuntimeException: foo
	at net.anotheria.anoplass.api.generic.observation.ObservationAPITest$2.notifySubjectUpdatedForCurrentUser(ObservationAPITest.java:71)
	at net.anotheria.anoplass.api.generic.observation.ObservationAPIImpl.fireSubjectUpdateForCurrentUser(ObservationAPIImpl.java:52)
	at sun.reflect.GeneratedMethodAccessor4.invoke(Unknown Source)
	at sun.reflect.DelegatingMethodAccessorImpl.invoke(DelegatingMethodAccessorImpl.java:43)
	at java.lang.reflect.Method.invoke(Method.java:498)
	at net.anotheria.moskito.core.predefined.ServiceStatsCallHandler.invoke(ServiceStatsCallHandler.java:102)
	at net.anotheria.moskito.core.dynamic.MoskitoInvokationProxy.invoke(MoskitoInvokationProxy.java:183)
	at com.sun.proxy.$Proxy16.fireSubjectUpdateForCurrentUser(Unknown Source)
	at sun.reflect.GeneratedMethodAccessor4.invoke(Unknown Source)
	at sun.reflect.DelegatingMethodAccessorImpl.invoke(DelegatingMethodAccessorImpl.java:43)
	at java.lang.reflect.Method.invoke(Method.java:498)
	at net.anotheria.anoplass.api.APICallHandler.invoke(APICallHandler.java:92)
	at com.sun.proxy.$Proxy16.fireSubjectUpdateForCurrentUser(Unknown Source)
	at net.anotheria.anoplass.api.generic.observation.ObservationAPITest.testErrorInObserver(ObservationAPITest.java:78)
	at sun.reflect.NativeMethodAccessorImpl.invoke0(Native Method)
	at sun.reflect.NativeMethodAccessorImpl.invoke(NativeMethodAccessorImpl.java:62)
	at sun.reflect.DelegatingMethodAccessorImpl.invoke(DelegatingMethodAccessorImpl.java:43)
	at java.lang.reflect.Method.invoke(Method.java:498)
	at org.junit.runners.model.FrameworkMethod$1.runReflectiveCall(FrameworkMethod.java:50)
	at org.junit.internal.runners.model.ReflectiveCallable.run(ReflectiveCallable.java:12)
	at org.junit.runners.model.FrameworkMethod.invokeExplosively(FrameworkMethod.java:47)
	at org.junit.internal.runners.statements.InvokeMethod.evaluate(InvokeMethod.java:17)
	at org.junit.internal.runners.statements.RunBefores.evaluate(RunBefores.java:26)
	at org.junit.runners.ParentRunner.runLeaf(ParentRunner.java:325)
	at org.junit.runners.BlockJUnit4ClassRunner.runChild(BlockJUnit4ClassRunner.java:78)
	at org.junit.runners.BlockJUnit4ClassRunner.runChild(BlockJUnit4ClassRunner.java:57)
	at org.junit.runners.ParentRunner$3.run(ParentRunner.java:290)
	at org.junit.runners.ParentRunner$1.schedule(ParentRunner.java:71)
	at org.junit.runners.ParentRunner.runChildren(ParentRunner.java:288)
	at org.junit.runners.ParentRunner.access$000(ParentRunner.java:58)
	at org.junit.runners.ParentRunner$2.evaluate(ParentRunner.java:268)
	at org.junit.runners.ParentRunner.run(ParentRunner.java:363)
	at org.apache.maven.surefire.junit4.JUnit4Provider.execute(JUnit4Provider.java:367)
	at org.apache.maven.surefire.junit4.JUnit4Provider.executeWithRerun(JUnit4Provider.java:274)
	at org.apache.maven.surefire.junit4.JUnit4Provider.executeTestSet(JUnit4Provider.java:238)
	at org.apache.maven.surefire.junit4.JUnit4Provider.invoke(JUnit4Provider.java:161)
	at org.apache.maven.surefire.booter.ForkedBooter.invokeProviderInSameClassLoader(ForkedBooter.java:290)
	at org.apache.maven.surefire.booter.ForkedBooter.runSuitesInProcess(ForkedBooter.java:242)
	at org.apache.maven.surefire.booter.ForkedBooter.main(ForkedBooter.java:121)
19:17:22.586 [main] DEBUG net.anotheria.anoplass.api.generic.observation.ObservationAPIImpl - Firing update event for user 84, originator: 84 and subject: TEST
19:17:22.586 [main] DEBUG net.anotheria.anoplass.api.generic.observation.ObservationAPIImpl - Firing update event for current user, originator: 85 and subject: TEST
19:17:22.586 [main] WARN net.anotheria.anoplass.api.generic.observation.ObservationAPIImpl - (Uncaught exception in observer: net.anotheria.anoplass.api.generic.observation.ObservationAPITest$2@290d210d .notifySubjectUpdatedForCurrentUser(S: TEST, O: 85, U: current, T: 1523467042586, D: Wed. 11.04.2018, 19:17)
java.lang.RuntimeException: foo
	at net.anotheria.anoplass.api.generic.observation.ObservationAPITest$2.notifySubjectUpdatedForCurrentUser(ObservationAPITest.java:71)
	at net.anotheria.anoplass.api.generic.observation.ObservationAPIImpl.fireSubjectUpdateForCurrentUser(ObservationAPIImpl.java:52)
	at sun.reflect.GeneratedMethodAccessor4.invoke(Unknown Source)
	at sun.reflect.DelegatingMethodAccessorImpl.invoke(DelegatingMethodAccessorImpl.java:43)
	at java.lang.reflect.Method.invoke(Method.java:498)
	at net.anotheria.moskito.core.predefined.ServiceStatsCallHandler.invoke(ServiceStatsCallHandler.java:102)
	at net.anotheria.moskito.core.dynamic.MoskitoInvokationProxy.invoke(MoskitoInvokationProxy.java:183)
	at com.sun.proxy.$Proxy16.fireSubjectUpdateForCurrentUser(Unknown Source)
	at sun.reflect.GeneratedMethodAccessor4.invoke(Unknown Source)
	at sun.reflect.DelegatingMethodAccessorImpl.invoke(DelegatingMethodAccessorImpl.java:43)
	at java.lang.reflect.Method.invoke(Method.java:498)
	at net.anotheria.anoplass.api.APICallHandler.invoke(APICallHandler.java:92)
	at com.sun.proxy.$Proxy16.fireSubjectUpdateForCurrentUser(Unknown Source)
	at net.anotheria.anoplass.api.generic.observation.ObservationAPITest.testErrorInObserver(ObservationAPITest.java:78)
	at sun.reflect.NativeMethodAccessorImpl.invoke0(Native Method)
	at sun.reflect.NativeMethodAccessorImpl.invoke(NativeMethodAccessorImpl.java:62)
	at sun.reflect.DelegatingMethodAccessorImpl.invoke(DelegatingMethodAccessorImpl.java:43)
	at java.lang.reflect.Method.invoke(Method.java:498)
	at org.junit.runners.model.FrameworkMethod$1.runReflectiveCall(FrameworkMethod.java:50)
	at org.junit.internal.runners.model.ReflectiveCallable.run(ReflectiveCallable.java:12)
	at org.junit.runners.model.FrameworkMethod.invokeExplosively(FrameworkMethod.java:47)
	at org.junit.internal.runners.statements.InvokeMethod.evaluate(InvokeMethod.java:17)
	at org.junit.internal.runners.statements.RunBefores.evaluate(RunBefores.java:26)
	at org.junit.runners.ParentRunner.runLeaf(ParentRunner.java:325)
	at org.junit.runners.BlockJUnit4ClassRunner.runChild(BlockJUnit4ClassRunner.java:78)
	at org.junit.runners.BlockJUnit4ClassRunner.runChild(BlockJUnit4ClassRunner.java:57)
	at org.junit.runners.ParentRunner$3.run(ParentRunner.java:290)
	at org.junit.runners.ParentRunner$1.schedule(ParentRunner.java:71)
	at org.junit.runners.ParentRunner.runChildren(ParentRunner.java:288)
	at org.junit.runners.ParentRunner.access$000(ParentRunner.java:58)
	at org.junit.runners.ParentRunner$2.evaluate(ParentRunner.java:268)
	at org.junit.runners.ParentRunner.run(ParentRunner.java:363)
	at org.apache.maven.surefire.junit4.JUnit4Provider.execute(JUnit4Provider.java:367)
	at org.apache.maven.surefire.junit4.JUnit4Provider.executeWithRerun(JUnit4Provider.java:274)
	at org.apache.maven.surefire.junit4.JUnit4Provider.executeTestSet(JUnit4Provider.java:238)
	at org.apache.maven.surefire.junit4.JUnit4Provider.invoke(JUnit4Provider.java:161)
	at org.apache.maven.surefire.booter.ForkedBooter.invokeProviderInSameClassLoader(ForkedBooter.java:290)
	at org.apache.maven.surefire.booter.ForkedBooter.runSuitesInProcess(ForkedBooter.java:242)
	at org.apache.maven.surefire.booter.ForkedBooter.main(ForkedBooter.java:121)
19:17:22.587 [main] DEBUG net.anotheria.anoplass.api.generic.observation.ObservationAPIImpl - Firing update event for user 86, originator: 86 and subject: TEST
19:17:22.587 [main] DEBUG net.anotheria.anoplass.api.generic.observation.ObservationAPIImpl - Firing update event for current user, originator: 87 and subject: TEST
19:17:22.587 [main] WARN net.anotheria.anoplass.api.generic.observation.ObservationAPIImpl - (Uncaught exception in observer: net.anotheria.anoplass.api.generic.observation.ObservationAPITest$2@290d210d .notifySubjectUpdatedForCurrentUser(S: TEST, O: 87, U: current, T: 1523467042587, D: Wed. 11.04.2018, 19:17)
java.lang.RuntimeException: foo
	at net.anotheria.anoplass.api.generic.observation.ObservationAPITest$2.notifySubjectUpdatedForCurrentUser(ObservationAPITest.java:71)
	at net.anotheria.anoplass.api.generic.observation.ObservationAPIImpl.fireSubjectUpdateForCurrentUser(ObservationAPIImpl.java:52)
	at sun.reflect.GeneratedMethodAccessor4.invoke(Unknown Source)
	at sun.reflect.DelegatingMethodAccessorImpl.invoke(DelegatingMethodAccessorImpl.java:43)
	at java.lang.reflect.Method.invoke(Method.java:498)
	at net.anotheria.moskito.core.predefined.ServiceStatsCallHandler.invoke(ServiceStatsCallHandler.java:102)
	at net.anotheria.moskito.core.dynamic.MoskitoInvokationProxy.invoke(MoskitoInvokationProxy.java:183)
	at com.sun.proxy.$Proxy16.fireSubjectUpdateForCurrentUser(Unknown Source)
	at sun.reflect.GeneratedMethodAccessor4.invoke(Unknown Source)
	at sun.reflect.DelegatingMethodAccessorImpl.invoke(DelegatingMethodAccessorImpl.java:43)
	at java.lang.reflect.Method.invoke(Method.java:498)
	at net.anotheria.anoplass.api.APICallHandler.invoke(APICallHandler.java:92)
	at com.sun.proxy.$Proxy16.fireSubjectUpdateForCurrentUser(Unknown Source)
	at net.anotheria.anoplass.api.generic.observation.ObservationAPITest.testErrorInObserver(ObservationAPITest.java:78)
	at sun.reflect.NativeMethodAccessorImpl.invoke0(Native Method)
	at sun.reflect.NativeMethodAccessorImpl.invoke(NativeMethodAccessorImpl.java:62)
	at sun.reflect.DelegatingMethodAccessorImpl.invoke(DelegatingMethodAccessorImpl.java:43)
	at java.lang.reflect.Method.invoke(Method.java:498)
	at org.junit.runners.model.FrameworkMethod$1.runReflectiveCall(FrameworkMethod.java:50)
	at org.junit.internal.runners.model.ReflectiveCallable.run(ReflectiveCallable.java:12)
	at org.junit.runners.model.FrameworkMethod.invokeExplosively(FrameworkMethod.java:47)
	at org.junit.internal.runners.statements.InvokeMethod.evaluate(InvokeMethod.java:17)
	at org.junit.internal.runners.statements.RunBefores.evaluate(RunBefores.java:26)
	at org.junit.runners.ParentRunner.runLeaf(ParentRunner.java:325)
	at org.junit.runners.BlockJUnit4ClassRunner.runChild(BlockJUnit4ClassRunner.java:78)
	at org.junit.runners.BlockJUnit4ClassRunner.runChild(BlockJUnit4ClassRunner.java:57)
	at org.junit.runners.ParentRunner$3.run(ParentRunner.java:290)
	at org.junit.runners.ParentRunner$1.schedule(ParentRunner.java:71)
	at org.junit.runners.ParentRunner.runChildren(ParentRunner.java:288)
	at org.junit.runners.ParentRunner.access$000(ParentRunner.java:58)
	at org.junit.runners.ParentRunner$2.evaluate(ParentRunner.java:268)
	at org.junit.runners.ParentRunner.run(ParentRunner.java:363)
	at org.apache.maven.surefire.junit4.JUnit4Provider.execute(JUnit4Provider.java:367)
	at org.apache.maven.surefire.junit4.JUnit4Provider.executeWithRerun(JUnit4Provider.java:274)
	at org.apache.maven.surefire.junit4.JUnit4Provider.executeTestSet(JUnit4Provider.java:238)
	at org.apache.maven.surefire.junit4.JUnit4Provider.invoke(JUnit4Provider.java:161)
	at org.apache.maven.surefire.booter.ForkedBooter.invokeProviderInSameClassLoader(ForkedBooter.java:290)
	at org.apache.maven.surefire.booter.ForkedBooter.runSuitesInProcess(ForkedBooter.java:242)
	at org.apache.maven.surefire.booter.ForkedBooter.main(ForkedBooter.java:121)
19:17:22.587 [main] DEBUG net.anotheria.anoplass.api.generic.observation.ObservationAPIImpl - Firing update event for user 88, originator: 88 and subject: TEST
19:17:22.587 [main] DEBUG net.anotheria.anoplass.api.generic.observation.ObservationAPIImpl - Firing update event for current user, originator: 89 and subject: TEST
19:17:22.587 [main] WARN net.anotheria.anoplass.api.generic.observation.ObservationAPIImpl - (Uncaught exception in observer: net.anotheria.anoplass.api.generic.observation.ObservationAPITest$2@290d210d .notifySubjectUpdatedForCurrentUser(S: TEST, O: 89, U: current, T: 1523467042587, D: Wed. 11.04.2018, 19:17)
java.lang.RuntimeException: foo
	at net.anotheria.anoplass.api.generic.observation.ObservationAPITest$2.notifySubjectUpdatedForCurrentUser(ObservationAPITest.java:71)
	at net.anotheria.anoplass.api.generic.observation.ObservationAPIImpl.fireSubjectUpdateForCurrentUser(ObservationAPIImpl.java:52)
	at sun.reflect.GeneratedMethodAccessor4.invoke(Unknown Source)
	at sun.reflect.DelegatingMethodAccessorImpl.invoke(DelegatingMethodAccessorImpl.java:43)
	at java.lang.reflect.Method.invoke(Method.java:498)
	at net.anotheria.moskito.core.predefined.ServiceStatsCallHandler.invoke(ServiceStatsCallHandler.java:102)
	at net.anotheria.moskito.core.dynamic.MoskitoInvokationProxy.invoke(MoskitoInvokationProxy.java:183)
	at com.sun.proxy.$Proxy16.fireSubjectUpdateForCurrentUser(Unknown Source)
	at sun.reflect.GeneratedMethodAccessor4.invoke(Unknown Source)
	at sun.reflect.DelegatingMethodAccessorImpl.invoke(DelegatingMethodAccessorImpl.java:43)
	at java.lang.reflect.Method.invoke(Method.java:498)
	at net.anotheria.anoplass.api.APICallHandler.invoke(APICallHandler.java:92)
	at com.sun.proxy.$Proxy16.fireSubjectUpdateForCurrentUser(Unknown Source)
	at net.anotheria.anoplass.api.generic.observation.ObservationAPITest.testErrorInObserver(ObservationAPITest.java:78)
	at sun.reflect.NativeMethodAccessorImpl.invoke0(Native Method)
	at sun.reflect.NativeMethodAccessorImpl.invoke(NativeMethodAccessorImpl.java:62)
	at sun.reflect.DelegatingMethodAccessorImpl.invoke(DelegatingMethodAccessorImpl.java:43)
	at java.lang.reflect.Method.invoke(Method.java:498)
	at org.junit.runners.model.FrameworkMethod$1.runReflectiveCall(FrameworkMethod.java:50)
	at org.junit.internal.runners.model.ReflectiveCallable.run(ReflectiveCallable.java:12)
	at org.junit.runners.model.FrameworkMethod.invokeExplosively(FrameworkMethod.java:47)
	at org.junit.internal.runners.statements.InvokeMethod.evaluate(InvokeMethod.java:17)
	at org.junit.internal.runners.statements.RunBefores.evaluate(RunBefores.java:26)
	at org.junit.runners.ParentRunner.runLeaf(ParentRunner.java:325)
	at org.junit.runners.BlockJUnit4ClassRunner.runChild(BlockJUnit4ClassRunner.java:78)
	at org.junit.runners.BlockJUnit4ClassRunner.runChild(BlockJUnit4ClassRunner.java:57)
	at org.junit.runners.ParentRunner$3.run(ParentRunner.java:290)
	at org.junit.runners.ParentRunner$1.schedule(ParentRunner.java:71)
	at org.junit.runners.ParentRunner.runChildren(ParentRunner.java:288)
	at org.junit.runners.ParentRunner.access$000(ParentRunner.java:58)
	at org.junit.runners.ParentRunner$2.evaluate(ParentRunner.java:268)
	at org.junit.runners.ParentRunner.run(ParentRunner.java:363)
	at org.apache.maven.surefire.junit4.JUnit4Provider.execute(JUnit4Provider.java:367)
	at org.apache.maven.surefire.junit4.JUnit4Provider.executeWithRerun(JUnit4Provider.java:274)
	at org.apache.maven.surefire.junit4.JUnit4Provider.executeTestSet(JUnit4Provider.java:238)
	at org.apache.maven.surefire.junit4.JUnit4Provider.invoke(JUnit4Provider.java:161)
	at org.apache.maven.surefire.booter.ForkedBooter.invokeProviderInSameClassLoader(ForkedBooter.java:290)
	at org.apache.maven.surefire.booter.ForkedBooter.runSuitesInProcess(ForkedBooter.java:242)
	at org.apache.maven.surefire.booter.ForkedBooter.main(ForkedBooter.java:121)
19:17:22.588 [main] DEBUG net.anotheria.anoplass.api.generic.observation.ObservationAPIImpl - Firing update event for user 90, originator: 90 and subject: TEST
19:17:22.588 [main] DEBUG net.anotheria.anoplass.api.generic.observation.ObservationAPIImpl - Firing update event for current user, originator: 91 and subject: TEST
19:17:22.588 [main] WARN net.anotheria.anoplass.api.generic.observation.ObservationAPIImpl - (Uncaught exception in observer: net.anotheria.anoplass.api.generic.observation.ObservationAPITest$2@290d210d .notifySubjectUpdatedForCurrentUser(S: TEST, O: 91, U: current, T: 1523467042588, D: Wed. 11.04.2018, 19:17)
java.lang.RuntimeException: foo
	at net.anotheria.anoplass.api.generic.observation.ObservationAPITest$2.notifySubjectUpdatedForCurrentUser(ObservationAPITest.java:71)
	at net.anotheria.anoplass.api.generic.observation.ObservationAPIImpl.fireSubjectUpdateForCurrentUser(ObservationAPIImpl.java:52)
	at sun.reflect.GeneratedMethodAccessor4.invoke(Unknown Source)
	at sun.reflect.DelegatingMethodAccessorImpl.invoke(DelegatingMethodAccessorImpl.java:43)
	at java.lang.reflect.Method.invoke(Method.java:498)
	at net.anotheria.moskito.core.predefined.ServiceStatsCallHandler.invoke(ServiceStatsCallHandler.java:102)
	at net.anotheria.moskito.core.dynamic.MoskitoInvokationProxy.invoke(MoskitoInvokationProxy.java:183)
	at com.sun.proxy.$Proxy16.fireSubjectUpdateForCurrentUser(Unknown Source)
	at sun.reflect.GeneratedMethodAccessor4.invoke(Unknown Source)
	at sun.reflect.DelegatingMethodAccessorImpl.invoke(DelegatingMethodAccessorImpl.java:43)
	at java.lang.reflect.Method.invoke(Method.java:498)
	at net.anotheria.anoplass.api.APICallHandler.invoke(APICallHandler.java:92)
	at com.sun.proxy.$Proxy16.fireSubjectUpdateForCurrentUser(Unknown Source)
	at net.anotheria.anoplass.api.generic.observation.ObservationAPITest.testErrorInObserver(ObservationAPITest.java:78)
	at sun.reflect.NativeMethodAccessorImpl.invoke0(Native Method)
	at sun.reflect.NativeMethodAccessorImpl.invoke(NativeMethodAccessorImpl.java:62)
	at sun.reflect.DelegatingMethodAccessorImpl.invoke(DelegatingMethodAccessorImpl.java:43)
	at java.lang.reflect.Method.invoke(Method.java:498)
	at org.junit.runners.model.FrameworkMethod$1.runReflectiveCall(FrameworkMethod.java:50)
	at org.junit.internal.runners.model.ReflectiveCallable.run(ReflectiveCallable.java:12)
	at org.junit.runners.model.FrameworkMethod.invokeExplosively(FrameworkMethod.java:47)
	at org.junit.internal.runners.statements.InvokeMethod.evaluate(InvokeMethod.java:17)
	at org.junit.internal.runners.statements.RunBefores.evaluate(RunBefores.java:26)
	at org.junit.runners.ParentRunner.runLeaf(ParentRunner.java:325)
	at org.junit.runners.BlockJUnit4ClassRunner.runChild(BlockJUnit4ClassRunner.java:78)
	at org.junit.runners.BlockJUnit4ClassRunner.runChild(BlockJUnit4ClassRunner.java:57)
	at org.junit.runners.ParentRunner$3.run(ParentRunner.java:290)
	at org.junit.runners.ParentRunner$1.schedule(ParentRunner.java:71)
	at org.junit.runners.ParentRunner.runChildren(ParentRunner.java:288)
	at org.junit.runners.ParentRunner.access$000(ParentRunner.java:58)
	at org.junit.runners.ParentRunner$2.evaluate(ParentRunner.java:268)
	at org.junit.runners.ParentRunner.run(ParentRunner.java:363)
	at org.apache.maven.surefire.junit4.JUnit4Provider.execute(JUnit4Provider.java:367)
	at org.apache.maven.surefire.junit4.JUnit4Provider.executeWithRerun(JUnit4Provider.java:274)
	at org.apache.maven.surefire.junit4.JUnit4Provider.executeTestSet(JUnit4Provider.java:238)
	at org.apache.maven.surefire.junit4.JUnit4Provider.invoke(JUnit4Provider.java:161)
	at org.apache.maven.surefire.booter.ForkedBooter.invokeProviderInSameClassLoader(ForkedBooter.java:290)
	at org.apache.maven.surefire.booter.ForkedBooter.runSuitesInProcess(ForkedBooter.java:242)
	at org.apache.maven.surefire.booter.ForkedBooter.main(ForkedBooter.java:121)
19:17:22.588 [main] DEBUG net.anotheria.anoplass.api.generic.observation.ObservationAPIImpl - Firing update event for user 92, originator: 92 and subject: TEST
19:17:22.588 [main] DEBUG net.anotheria.anoplass.api.generic.observation.ObservationAPIImpl - Firing update event for current user, originator: 93 and subject: TEST
19:17:22.588 [main] WARN net.anotheria.anoplass.api.generic.observation.ObservationAPIImpl - (Uncaught exception in observer: net.anotheria.anoplass.api.generic.observation.ObservationAPITest$2@290d210d .notifySubjectUpdatedForCurrentUser(S: TEST, O: 93, U: current, T: 1523467042588, D: Wed. 11.04.2018, 19:17)
java.lang.RuntimeException: foo
	at net.anotheria.anoplass.api.generic.observation.ObservationAPITest$2.notifySubjectUpdatedForCurrentUser(ObservationAPITest.java:71)
	at net.anotheria.anoplass.api.generic.observation.ObservationAPIImpl.fireSubjectUpdateForCurrentUser(ObservationAPIImpl.java:52)
	at sun.reflect.GeneratedMethodAccessor4.invoke(Unknown Source)
	at sun.reflect.DelegatingMethodAccessorImpl.invoke(DelegatingMethodAccessorImpl.java:43)
	at java.lang.reflect.Method.invoke(Method.java:498)
	at net.anotheria.moskito.core.predefined.ServiceStatsCallHandler.invoke(ServiceStatsCallHandler.java:102)
	at net.anotheria.moskito.core.dynamic.MoskitoInvokationProxy.invoke(MoskitoInvokationProxy.java:183)
	at com.sun.proxy.$Proxy16.fireSubjectUpdateForCurrentUser(Unknown Source)
	at sun.reflect.GeneratedMethodAccessor4.invoke(Unknown Source)
	at sun.reflect.DelegatingMethodAccessorImpl.invoke(DelegatingMethodAccessorImpl.java:43)
	at java.lang.reflect.Method.invoke(Method.java:498)
	at net.anotheria.anoplass.api.APICallHandler.invoke(APICallHandler.java:92)
	at com.sun.proxy.$Proxy16.fireSubjectUpdateForCurrentUser(Unknown Source)
	at net.anotheria.anoplass.api.generic.observation.ObservationAPITest.testErrorInObserver(ObservationAPITest.java:78)
	at sun.reflect.NativeMethodAccessorImpl.invoke0(Native Method)
	at sun.reflect.NativeMethodAccessorImpl.invoke(NativeMethodAccessorImpl.java:62)
	at sun.reflect.DelegatingMethodAccessorImpl.invoke(DelegatingMethodAccessorImpl.java:43)
	at java.lang.reflect.Method.invoke(Method.java:498)
	at org.junit.runners.model.FrameworkMethod$1.runReflectiveCall(FrameworkMethod.java:50)
	at org.junit.internal.runners.model.ReflectiveCallable.run(ReflectiveCallable.java:12)
	at org.junit.runners.model.FrameworkMethod.invokeExplosively(FrameworkMethod.java:47)
	at org.junit.internal.runners.statements.InvokeMethod.evaluate(InvokeMethod.java:17)
	at org.junit.internal.runners.statements.RunBefores.evaluate(RunBefores.java:26)
	at org.junit.runners.ParentRunner.runLeaf(ParentRunner.java:325)
	at org.junit.runners.BlockJUnit4ClassRunner.runChild(BlockJUnit4ClassRunner.java:78)
	at org.junit.runners.BlockJUnit4ClassRunner.runChild(BlockJUnit4ClassRunner.java:57)
	at org.junit.runners.ParentRunner$3.run(ParentRunner.java:290)
	at org.junit.runners.ParentRunner$1.schedule(ParentRunner.java:71)
	at org.junit.runners.ParentRunner.runChildren(ParentRunner.java:288)
	at org.junit.runners.ParentRunner.access$000(ParentRunner.java:58)
	at org.junit.runners.ParentRunner$2.evaluate(ParentRunner.java:268)
	at org.junit.runners.ParentRunner.run(ParentRunner.java:363)
	at org.apache.maven.surefire.junit4.JUnit4Provider.execute(JUnit4Provider.java:367)
	at org.apache.maven.surefire.junit4.JUnit4Provider.executeWithRerun(JUnit4Provider.java:274)
	at org.apache.maven.surefire.junit4.JUnit4Provider.executeTestSet(JUnit4Provider.java:238)
	at org.apache.maven.surefire.junit4.JUnit4Provider.invoke(JUnit4Provider.java:161)
	at org.apache.maven.surefire.booter.ForkedBooter.invokeProviderInSameClassLoader(ForkedBooter.java:290)
	at org.apache.maven.surefire.booter.ForkedBooter.runSuitesInProcess(ForkedBooter.java:242)
	at org.apache.maven.surefire.booter.ForkedBooter.main(ForkedBooter.java:121)
19:17:22.589 [main] DEBUG net.anotheria.anoplass.api.generic.observation.ObservationAPIImpl - Firing update event for user 94, originator: 94 and subject: TEST
19:17:22.589 [main] DEBUG net.anotheria.anoplass.api.generic.observation.ObservationAPIImpl - Firing update event for current user, originator: 95 and subject: TEST
19:17:22.589 [main] WARN net.anotheria.anoplass.api.generic.observation.ObservationAPIImpl - (Uncaught exception in observer: net.anotheria.anoplass.api.generic.observation.ObservationAPITest$2@290d210d .notifySubjectUpdatedForCurrentUser(S: TEST, O: 95, U: current, T: 1523467042589, D: Wed. 11.04.2018, 19:17)
java.lang.RuntimeException: foo
	at net.anotheria.anoplass.api.generic.observation.ObservationAPITest$2.notifySubjectUpdatedForCurrentUser(ObservationAPITest.java:71)
	at net.anotheria.anoplass.api.generic.observation.ObservationAPIImpl.fireSubjectUpdateForCurrentUser(ObservationAPIImpl.java:52)
	at sun.reflect.GeneratedMethodAccessor4.invoke(Unknown Source)
	at sun.reflect.DelegatingMethodAccessorImpl.invoke(DelegatingMethodAccessorImpl.java:43)
	at java.lang.reflect.Method.invoke(Method.java:498)
	at net.anotheria.moskito.core.predefined.ServiceStatsCallHandler.invoke(ServiceStatsCallHandler.java:102)
	at net.anotheria.moskito.core.dynamic.MoskitoInvokationProxy.invoke(MoskitoInvokationProxy.java:183)
	at com.sun.proxy.$Proxy16.fireSubjectUpdateForCurrentUser(Unknown Source)
	at sun.reflect.GeneratedMethodAccessor4.invoke(Unknown Source)
	at sun.reflect.DelegatingMethodAccessorImpl.invoke(DelegatingMethodAccessorImpl.java:43)
	at java.lang.reflect.Method.invoke(Method.java:498)
	at net.anotheria.anoplass.api.APICallHandler.invoke(APICallHandler.java:92)
	at com.sun.proxy.$Proxy16.fireSubjectUpdateForCurrentUser(Unknown Source)
	at net.anotheria.anoplass.api.generic.observation.ObservationAPITest.testErrorInObserver(ObservationAPITest.java:78)
	at sun.reflect.NativeMethodAccessorImpl.invoke0(Native Method)
	at sun.reflect.NativeMethodAccessorImpl.invoke(NativeMethodAccessorImpl.java:62)
	at sun.reflect.DelegatingMethodAccessorImpl.invoke(DelegatingMethodAccessorImpl.java:43)
	at java.lang.reflect.Method.invoke(Method.java:498)
	at org.junit.runners.model.FrameworkMethod$1.runReflectiveCall(FrameworkMethod.java:50)
	at org.junit.internal.runners.model.ReflectiveCallable.run(ReflectiveCallable.java:12)
	at org.junit.runners.model.FrameworkMethod.invokeExplosively(FrameworkMethod.java:47)
	at org.junit.internal.runners.statements.InvokeMethod.evaluate(InvokeMethod.java:17)
	at org.junit.internal.runners.statements.RunBefores.evaluate(RunBefores.java:26)
	at org.junit.runners.ParentRunner.runLeaf(ParentRunner.java:325)
	at org.junit.runners.BlockJUnit4ClassRunner.runChild(BlockJUnit4ClassRunner.java:78)
	at org.junit.runners.BlockJUnit4ClassRunner.runChild(BlockJUnit4ClassRunner.java:57)
	at org.junit.runners.ParentRunner$3.run(ParentRunner.java:290)
	at org.junit.runners.ParentRunner$1.schedule(ParentRunner.java:71)
	at org.junit.runners.ParentRunner.runChildren(ParentRunner.java:288)
	at org.junit.runners.ParentRunner.access$000(ParentRunner.java:58)
	at org.junit.runners.ParentRunner$2.evaluate(ParentRunner.java:268)
	at org.junit.runners.ParentRunner.run(ParentRunner.java:363)
	at org.apache.maven.surefire.junit4.JUnit4Provider.execute(JUnit4Provider.java:367)
	at org.apache.maven.surefire.junit4.JUnit4Provider.executeWithRerun(JUnit4Provider.java:274)
	at org.apache.maven.surefire.junit4.JUnit4Provider.executeTestSet(JUnit4Provider.java:238)
	at org.apache.maven.surefire.junit4.JUnit4Provider.invoke(JUnit4Provider.java:161)
	at org.apache.maven.surefire.booter.ForkedBooter.invokeProviderInSameClassLoader(ForkedBooter.java:290)
	at org.apache.maven.surefire.booter.ForkedBooter.runSuitesInProcess(ForkedBooter.java:242)
	at org.apache.maven.surefire.booter.ForkedBooter.main(ForkedBooter.java:121)
19:17:22.589 [main] DEBUG net.anotheria.anoplass.api.generic.observation.ObservationAPIImpl - Firing update event for user 96, originator: 96 and subject: TEST
19:17:22.589 [main] DEBUG net.anotheria.anoplass.api.generic.observation.ObservationAPIImpl - Firing update event for current user, originator: 97 and subject: TEST
19:17:22.590 [main] WARN net.anotheria.anoplass.api.generic.observation.ObservationAPIImpl - (Uncaught exception in observer: net.anotheria.anoplass.api.generic.observation.ObservationAPITest$2@290d210d .notifySubjectUpdatedForCurrentUser(S: TEST, O: 97, U: current, T: 1523467042589, D: Wed. 11.04.2018, 19:17)
java.lang.RuntimeException: foo
	at net.anotheria.anoplass.api.generic.observation.ObservationAPITest$2.notifySubjectUpdatedForCurrentUser(ObservationAPITest.java:71)
	at net.anotheria.anoplass.api.generic.observation.ObservationAPIImpl.fireSubjectUpdateForCurrentUser(ObservationAPIImpl.java:52)
	at sun.reflect.GeneratedMethodAccessor4.invoke(Unknown Source)
	at sun.reflect.DelegatingMethodAccessorImpl.invoke(DelegatingMethodAccessorImpl.java:43)
	at java.lang.reflect.Method.invoke(Method.java:498)
	at net.anotheria.moskito.core.predefined.ServiceStatsCallHandler.invoke(ServiceStatsCallHandler.java:102)
	at net.anotheria.moskito.core.dynamic.MoskitoInvokationProxy.invoke(MoskitoInvokationProxy.java:183)
	at com.sun.proxy.$Proxy16.fireSubjectUpdateForCurrentUser(Unknown Source)
	at sun.reflect.GeneratedMethodAccessor4.invoke(Unknown Source)
	at sun.reflect.DelegatingMethodAccessorImpl.invoke(DelegatingMethodAccessorImpl.java:43)
	at java.lang.reflect.Method.invoke(Method.java:498)
	at net.anotheria.anoplass.api.APICallHandler.invoke(APICallHandler.java:92)
	at com.sun.proxy.$Proxy16.fireSubjectUpdateForCurrentUser(Unknown Source)
	at net.anotheria.anoplass.api.generic.observation.ObservationAPITest.testErrorInObserver(ObservationAPITest.java:78)
	at sun.reflect.NativeMethodAccessorImpl.invoke0(Native Method)
	at sun.reflect.NativeMethodAccessorImpl.invoke(NativeMethodAccessorImpl.java:62)
	at sun.reflect.DelegatingMethodAccessorImpl.invoke(DelegatingMethodAccessorImpl.java:43)
	at java.lang.reflect.Method.invoke(Method.java:498)
	at org.junit.runners.model.FrameworkMethod$1.runReflectiveCall(FrameworkMethod.java:50)
	at org.junit.internal.runners.model.ReflectiveCallable.run(ReflectiveCallable.java:12)
	at org.junit.runners.model.FrameworkMethod.invokeExplosively(FrameworkMethod.java:47)
	at org.junit.internal.runners.statements.InvokeMethod.evaluate(InvokeMethod.java:17)
	at org.junit.internal.runners.statements.RunBefores.evaluate(RunBefores.java:26)
	at org.junit.runners.ParentRunner.runLeaf(ParentRunner.java:325)
	at org.junit.runners.BlockJUnit4ClassRunner.runChild(BlockJUnit4ClassRunner.java:78)
	at org.junit.runners.BlockJUnit4ClassRunner.runChild(BlockJUnit4ClassRunner.java:57)
	at org.junit.runners.ParentRunner$3.run(ParentRunner.java:290)
	at org.junit.runners.ParentRunner$1.schedule(ParentRunner.java:71)
	at org.junit.runners.ParentRunner.runChildren(ParentRunner.java:288)
	at org.junit.runners.ParentRunner.access$000(ParentRunner.java:58)
	at org.junit.runners.ParentRunner$2.evaluate(ParentRunner.java:268)
	at org.junit.runners.ParentRunner.run(ParentRunner.java:363)
	at org.apache.maven.surefire.junit4.JUnit4Provider.execute(JUnit4Provider.java:367)
	at org.apache.maven.surefire.junit4.JUnit4Provider.executeWithRerun(JUnit4Provider.java:274)
	at org.apache.maven.surefire.junit4.JUnit4Provider.executeTestSet(JUnit4Provider.java:238)
	at org.apache.maven.surefire.junit4.JUnit4Provider.invoke(JUnit4Provider.java:161)
	at org.apache.maven.surefire.booter.ForkedBooter.invokeProviderInSameClassLoader(ForkedBooter.java:290)
	at org.apache.maven.surefire.booter.ForkedBooter.runSuitesInProcess(ForkedBooter.java:242)
	at org.apache.maven.surefire.booter.ForkedBooter.main(ForkedBooter.java:121)
19:17:22.590 [main] DEBUG net.anotheria.anoplass.api.generic.observation.ObservationAPIImpl - Firing update event for user 98, originator: 98 and subject: TEST
19:17:22.591 [main] DEBUG net.anotheria.anoplass.api.generic.observation.ObservationAPIImpl - Firing update event for current user, originator: 99 and subject: TEST
19:17:22.591 [main] WARN net.anotheria.anoplass.api.generic.observation.ObservationAPIImpl - (Uncaught exception in observer: net.anotheria.anoplass.api.generic.observation.ObservationAPITest$2@290d210d .notifySubjectUpdatedForCurrentUser(S: TEST, O: 99, U: current, T: 1523467042591, D: Wed. 11.04.2018, 19:17)
java.lang.RuntimeException: foo
	at net.anotheria.anoplass.api.generic.observation.ObservationAPITest$2.notifySubjectUpdatedForCurrentUser(ObservationAPITest.java:71)
	at net.anotheria.anoplass.api.generic.observation.ObservationAPIImpl.fireSubjectUpdateForCurrentUser(ObservationAPIImpl.java:52)
	at sun.reflect.GeneratedMethodAccessor4.invoke(Unknown Source)
	at sun.reflect.DelegatingMethodAccessorImpl.invoke(DelegatingMethodAccessorImpl.java:43)
	at java.lang.reflect.Method.invoke(Method.java:498)
	at net.anotheria.moskito.core.predefined.ServiceStatsCallHandler.invoke(ServiceStatsCallHandler.java:102)
	at net.anotheria.moskito.core.dynamic.MoskitoInvokationProxy.invoke(MoskitoInvokationProxy.java:183)
	at com.sun.proxy.$Proxy16.fireSubjectUpdateForCurrentUser(Unknown Source)
	at sun.reflect.GeneratedMethodAccessor4.invoke(Unknown Source)
	at sun.reflect.DelegatingMethodAccessorImpl.invoke(DelegatingMethodAccessorImpl.java:43)
	at java.lang.reflect.Method.invoke(Method.java:498)
	at net.anotheria.anoplass.api.APICallHandler.invoke(APICallHandler.java:92)
	at com.sun.proxy.$Proxy16.fireSubjectUpdateForCurrentUser(Unknown Source)
	at net.anotheria.anoplass.api.generic.observation.ObservationAPITest.testErrorInObserver(ObservationAPITest.java:78)
	at sun.reflect.NativeMethodAccessorImpl.invoke0(Native Method)
	at sun.reflect.NativeMethodAccessorImpl.invoke(NativeMethodAccessorImpl.java:62)
	at sun.reflect.DelegatingMethodAccessorImpl.invoke(DelegatingMethodAccessorImpl.java:43)
	at java.lang.reflect.Method.invoke(Method.java:498)
	at org.junit.runners.model.FrameworkMethod$1.runReflectiveCall(FrameworkMethod.java:50)
	at org.junit.internal.runners.model.ReflectiveCallable.run(ReflectiveCallable.java:12)
	at org.junit.runners.model.FrameworkMethod.invokeExplosively(FrameworkMethod.java:47)
	at org.junit.internal.runners.statements.InvokeMethod.evaluate(InvokeMethod.java:17)
	at org.junit.internal.runners.statements.RunBefores.evaluate(RunBefores.java:26)
	at org.junit.runners.ParentRunner.runLeaf(ParentRunner.java:325)
	at org.junit.runners.BlockJUnit4ClassRunner.runChild(BlockJUnit4ClassRunner.java:78)
	at org.junit.runners.BlockJUnit4ClassRunner.runChild(BlockJUnit4ClassRunner.java:57)
	at org.junit.runners.ParentRunner$3.run(ParentRunner.java:290)
	at org.junit.runners.ParentRunner$1.schedule(ParentRunner.java:71)
	at org.junit.runners.ParentRunner.runChildren(ParentRunner.java:288)
	at org.junit.runners.ParentRunner.access$000(ParentRunner.java:58)
	at org.junit.runners.ParentRunner$2.evaluate(ParentRunner.java:268)
	at org.junit.runners.ParentRunner.run(ParentRunner.java:363)
	at org.apache.maven.surefire.junit4.JUnit4Provider.execute(JUnit4Provider.java:367)
	at org.apache.maven.surefire.junit4.JUnit4Provider.executeWithRerun(JUnit4Provider.java:274)
	at org.apache.maven.surefire.junit4.JUnit4Provider.executeTestSet(JUnit4Provider.java:238)
	at org.apache.maven.surefire.junit4.JUnit4Provider.invoke(JUnit4Provider.java:161)
	at org.apache.maven.surefire.booter.ForkedBooter.invokeProviderInSameClassLoader(ForkedBooter.java:290)
	at org.apache.maven.surefire.booter.ForkedBooter.runSuitesInProcess(ForkedBooter.java:242)
	at org.apache.maven.surefire.booter.ForkedBooter.main(ForkedBooter.java:121)
Tests run: 2, Failures: 0, Errors: 0, Skipped: 0, Time elapsed: 0.081 sec - in net.anotheria.anoplass.api.generic.observation.ObservationAPITest
19:17:22.595 [Thread-21] INFO APISessionManager_MultiProcessor_LOGGER - Shutting down processor!
19:17:22.595 [Thread-21] INFO APISessionManager_MultiProcessor_LOGGER - Wait while queue processing complete...
19:17:22.595 [Thread-6] INFO APISessionManager_MultiProcessor_LOGGER - Shutting down processor!
19:17:22.595 [Thread-6] INFO APISessionManager_MultiProcessor_LOGGER - Wait while queue processing complete...
19:17:22.595 [Thread-9] INFO APISessionManager_MultiProcessor_LOGGER - Shutting down processor!
19:17:22.595 [Thread-9] INFO APISessionManager_MultiProcessor_LOGGER - Wait while queue processing complete...
19:17:22.596 [Thread-13] INFO APISessionManager_MultiProcessor_LOGGER - Shutting down processor!
19:17:22.596 [Thread-13] INFO APISessionManager_MultiProcessor_LOGGER - Wait while queue processing complete...
19:17:22.596 [Thread-5] INFO APISessionManager_MultiProcessor_LOGGER - Shutting down processor!
19:17:22.596 [Thread-5] INFO APISessionManager_MultiProcessor_LOGGER - Wait while queue processing complete...
19:17:22.597 [Thread-11] INFO APISessionManager_MultiProcessor_LOGGER - Shutting down processor!
19:17:22.597 [Thread-11] INFO APISessionManager_MultiProcessor_LOGGER - Wait while queue processing complete...
19:17:22.597 [Thread-15] INFO APISessionManager_MultiProcessor_LOGGER - Shutting down processor!
19:17:22.597 [Thread-15] INFO APISessionManager_MultiProcessor_LOGGER - Wait while queue processing complete...
19:17:22.598 [Thread-19] INFO APISessionManager_MultiProcessor_LOGGER - Shutting down processor!
19:17:22.598 [Thread-19] INFO APISessionManager_MultiProcessor_LOGGER - Wait while queue processing complete...
19:17:22.598 [Thread-17] INFO APISessionManager_MultiProcessor_LOGGER - Shutting down processor!
19:17:22.598 [Thread-17] INFO APISessionManager_MultiProcessor_LOGGER - Wait while queue processing complete...
19:17:22.606 [apiSessionManagerQueuedMultiProcessor] INFO APISessionManager_MultiProcessor_LOGGER - Queue is empty and all works are done. Processing completed!
19:17:22.606 [Thread-17] INFO APISessionManager_MultiProcessor_LOGGER - Processor is shutted down!
19:17:22.607 [Thread-17] INFO APISessionManager_MultiProcessor_LOGGER - apiSessionManagerQueuedMultiProcessor  SS: 10 QS: 100 Arr: 0 Serv: 0 Err: 0 Wait: 0 Thr: 0 WT: 0 WTm: NoR WTM: NoR WTA: NoR ST: 0 STm: NoR STM: NoR STA: NoR,
QUEUE: EnterpriseQueueAdapter  Req: 0 Enq: 0 Full: 0 Empty: 27 Deq: 0 TS: 100 ELast: 0 EMin: 9223372036854775807 EMax: -9223372036854775808 EAvg: 0
19:17:22.613 [apiSessionManagerQueuedMultiProcessor] INFO APISessionManager_MultiProcessor_LOGGER - Queue is empty and all works are done. Processing completed!
19:17:22.613 [Thread-21] INFO APISessionManager_MultiProcessor_LOGGER - Processor is shutted down!
19:17:22.613 [Thread-21] INFO APISessionManager_MultiProcessor_LOGGER - apiSessionManagerQueuedMultiProcessor  SS: 10 QS: 100 Arr: 0 Serv: 0 Err: 0 Wait: 0 Thr: 0 WT: 0 WTm: NoR WTM: NoR WTA: NoR ST: 0 STm: NoR STM: NoR STA: NoR,
QUEUE: EnterpriseQueueAdapter  Req: 0 Enq: 0 Full: 0 Empty: 17 Deq: 0 TS: 100 ELast: 0 EMin: 9223372036854775807 EMax: -9223372036854775808 EAvg: 0
19:17:22.622 [Timer-1] INFO net.anotheria.anoprise.sessiondistributor.SessionDistributorServiceImpl - Finished session distributor cleanup run, removed sessions: 0, sizeBefore: 0, sizeAfter: 0
19:17:22.629 [apiSessionManagerQueuedMultiProcessor] INFO APISessionManager_MultiProcessor_LOGGER - Queue is empty and all works are done. Processing completed!
19:17:22.629 [Thread-6] INFO APISessionManager_MultiProcessor_LOGGER - Processor is shutted down!
19:17:22.629 [Thread-6] INFO APISessionManager_MultiProcessor_LOGGER - apiSessionManagerQueuedMultiProcessor  SS: 10 QS: 100 Arr: 0 Serv: 0 Err: 0 Wait: 0 Thr: 0 WT: 0 WTm: NoR WTM: NoR WTA: NoR ST: 0 STm: NoR STM: NoR STA: NoR,
QUEUE: EnterpriseQueueAdapter  Req: 0 Enq: 0 Full: 0 Empty: 31 Deq: 0 TS: 100 ELast: 0 EMin: 9223372036854775807 EMax: -9223372036854775808 EAvg: 0
19:17:22.694 [apiSessionManagerQueuedMultiProcessor] INFO APISessionManager_MultiProcessor_LOGGER - Queue is empty and all works are done. Processing completed!
19:17:22.694 [Thread-9] INFO APISessionManager_MultiProcessor_LOGGER - Processor is shutted down!
19:17:22.694 [Thread-9] INFO APISessionManager_MultiProcessor_LOGGER - apiSessionManagerQueuedMultiProcessor  SS: 10 QS: 100 Arr: 0 Serv: 0 Err: 0 Wait: 0 Thr: 0 WT: 0 WTm: NoR WTM: NoR WTA: NoR ST: 0 STm: NoR STM: NoR STA: NoR,
QUEUE: EnterpriseQueueAdapter  Req: 0 Enq: 0 Full: 0 Empty: 28 Deq: 0 TS: 100 ELast: 0 EMin: 9223372036854775807 EMax: -9223372036854775808 EAvg: 0
19:17:22.710 [apiSessionManagerQueuedMultiProcessor] INFO APISessionManager_MultiProcessor_LOGGER - Queue is empty and all works are done. Processing completed!
19:17:22.710 [Thread-11] INFO APISessionManager_MultiProcessor_LOGGER - Processor is shutted down!
19:17:22.710 [Thread-11] INFO APISessionManager_MultiProcessor_LOGGER - apiSessionManagerQueuedMultiProcessor  SS: 10 QS: 100 Arr: 0 Serv: 0 Err: 0 Wait: 0 Thr: 0 WT: 0 WTm: NoR WTM: NoR WTA: NoR ST: 0 STm: NoR STM: NoR STA: NoR,
QUEUE: EnterpriseQueueAdapter  Req: 0 Enq: 0 Full: 0 Empty: 28 Deq: 0 TS: 100 ELast: 0 EMin: 9223372036854775807 EMax: -9223372036854775808 EAvg: 0
19:17:22.722 [Timer-1] INFO net.anotheria.anoprise.sessiondistributor.SessionDistributorServiceImpl - Finished session distributor cleanup run, removed sessions: 0, sizeBefore: 0, sizeAfter: 0
19:17:22.735 [apiSessionManagerQueuedMultiProcessor] INFO APISessionManager_MultiProcessor_LOGGER - Queue is empty and all works are done. Processing completed!
19:17:22.735 [apiSessionManagerQueuedMultiProcessor] INFO APISessionManager_MultiProcessor_LOGGER - Queue is empty and all works are done. Processing completed!
19:17:22.735 [Thread-5] INFO APISessionManager_MultiProcessor_LOGGER - Processor is shutted down!
19:17:22.735 [Thread-5] INFO APISessionManager_MultiProcessor_LOGGER - apiSessionManagerQueuedMultiProcessor  SS: 10 QS: 100 Arr: 0 Serv: 0 Err: 0 Wait: 0 Thr: 0 WT: 0 WTm: NoR WTM: NoR WTA: NoR ST: 0 STm: NoR STM: NoR STA: NoR,
QUEUE: EnterpriseQueueAdapter  Req: 0 Enq: 0 Full: 0 Empty: 32 Deq: 0 TS: 100 ELast: 0 EMin: 9223372036854775807 EMax: -9223372036854775808 EAvg: 0
19:17:22.735 [Thread-13] INFO APISessionManager_MultiProcessor_LOGGER - Processor is shutted down!
19:17:22.735 [Thread-13] INFO APISessionManager_MultiProcessor_LOGGER - apiSessionManagerQueuedMultiProcessor  SS: 10 QS: 100 Arr: 0 Serv: 0 Err: 0 Wait: 0 Thr: 0 WT: 0 WTm: NoR WTM: NoR WTA: NoR ST: 0 STm: NoR STM: NoR STA: NoR,
QUEUE: EnterpriseQueueAdapter  Req: 0 Enq: 0 Full: 0 Empty: 28 Deq: 0 TS: 100 ELast: 0 EMin: 9223372036854775807 EMax: -9223372036854775808 EAvg: 0
19:17:22.739 [apiSessionManagerQueuedMultiProcessor] INFO APISessionManager_MultiProcessor_LOGGER - Queue is empty and all works are done. Processing completed!
19:17:22.739 [Thread-15] INFO APISessionManager_MultiProcessor_LOGGER - Processor is shutted down!
19:17:22.739 [Thread-15] INFO APISessionManager_MultiProcessor_LOGGER - apiSessionManagerQueuedMultiProcessor  SS: 10 QS: 100 Arr: 0 Serv: 0 Err: 0 Wait: 0 Thr: 0 WT: 0 WTm: NoR WTM: NoR WTA: NoR ST: 0 STm: NoR STM: NoR STA: NoR,
QUEUE: EnterpriseQueueAdapter  Req: 0 Enq: 0 Full: 0 Empty: 28 Deq: 0 TS: 100 ELast: 0 EMin: 9223372036854775807 EMax: -9223372036854775808 EAvg: 0
19:17:22.760 [apiSessionManagerQueuedMultiProcessor] INFO APISessionManager_MultiProcessor_LOGGER - Queue is empty and all works are done. Processing completed!
19:17:22.760 [Thread-19] INFO APISessionManager_MultiProcessor_LOGGER - Processor is shutted down!
19:17:22.760 [Thread-19] INFO APISessionManager_MultiProcessor_LOGGER - apiSessionManagerQueuedMultiProcessor  SS: 10 QS: 100 Arr: 5 Serv: 5 Err: 0 Wait: 0 Thr: 0 WT: 0 WTm: NoR WTM: NoR WTA: NoR ST: 7 STm: 0 STM: 4 STA: 1,
QUEUE: EnterpriseQueueAdapter  Req: 5 Enq: 5 Full: 0 Empty: 28 Deq: 5 TS: 100 ELast: 0 EMin: 0 EMax: 2 EAvg: 0

Results :

Tests run: 22, Failures: 0, Errors: 0, Skipped: 0

[JENKINS] Recording test results
[INFO] 
[INFO] --- maven-surefire-plugin:2.19.1:test (unit-tests) @ ano-plass ---
[INFO] Skipping execution of surefire because it has already been run for this configuration
[JENKINS] Recording test results
[INFO] 
[INFO] --- maven-jar-plugin:3.0.2:jar (default-jar) @ ano-plass ---
[INFO] Building jar: /opt/app/jenkins/jenkins_home/jobs/ano-plass_publish/workspace/target/ano-plass-2.1.4-SNAPSHOT.jar
[INFO] 
[INFO] --- maven-install-plugin:2.3.1:install (default-install) @ ano-plass ---
[INFO] Installing /opt/app/jenkins/jenkins_home/jobs/ano-plass_publish/workspace/target/ano-plass-2.1.4-SNAPSHOT.jar to /home/zeno/.m2/repository/net/anotheria/ano-plass/2.1.4-SNAPSHOT/ano-plass-2.1.4-SNAPSHOT.jar
[INFO] Installing /opt/app/jenkins/jenkins_home/jobs/ano-plass_publish/workspace/pom.xml to /home/zeno/.m2/repository/net/anotheria/ano-plass/2.1.4-SNAPSHOT/ano-plass-2.1.4-SNAPSHOT.pom
[INFO] 
[INFO] --- maven-deploy-plugin:2.7:deploy (default-deploy) @ ano-plass ---
Downloading: https://oss.sonatype.org/content/repositories/snapshots/net/anotheria/ano-plass/2.1.4-SNAPSHOT/maven-metadata.xml
Downloaded: https://oss.sonatype.org/content/repositories/snapshots/net/anotheria/ano-plass/2.1.4-SNAPSHOT/maven-metadata.xml (772 B at 0.2 KB/sec)
Uploading: https://oss.sonatype.org/content/repositories/snapshots/net/anotheria/ano-plass/2.1.4-SNAPSHOT/ano-plass-2.1.4-20180411.171730-4.jar
Uploaded: https://oss.sonatype.org/content/repositories/snapshots/net/anotheria/ano-plass/2.1.4-SNAPSHOT/ano-plass-2.1.4-20180411.171730-4.jar (107 KB at 63.2 KB/sec)
Uploading: https://oss.sonatype.org/content/repositories/snapshots/net/anotheria/ano-plass/2.1.4-SNAPSHOT/ano-plass-2.1.4-20180411.171730-4.pom
Uploaded: https://oss.sonatype.org/content/repositories/snapshots/net/anotheria/ano-plass/2.1.4-SNAPSHOT/ano-plass-2.1.4-20180411.171730-4.pom (3 KB at 1.3 KB/sec)
Downloading: https://oss.sonatype.org/content/repositories/snapshots/net/anotheria/ano-plass/maven-metadata.xml
Downloaded: https://oss.sonatype.org/content/repositories/snapshots/net/anotheria/ano-plass/maven-metadata.xml (422 B at 0.6 KB/sec)
Uploading: https://oss.sonatype.org/content/repositories/snapshots/net/anotheria/ano-plass/2.1.4-SNAPSHOT/maven-metadata.xml
Uploaded: https://oss.sonatype.org/content/repositories/snapshots/net/anotheria/ano-plass/2.1.4-SNAPSHOT/maven-metadata.xml (772 B at 0.6 KB/sec)
Uploading: https://oss.sonatype.org/content/repositories/snapshots/net/anotheria/ano-plass/maven-metadata.xml
Uploaded: https://oss.sonatype.org/content/repositories/snapshots/net/anotheria/ano-plass/maven-metadata.xml (422 B at 0.2 KB/sec)
Started calculate disk usage of build
Finished Calculation of disk usage of build in 0 seconds
Started calculate disk usage of workspace
Finished Calculation of disk usage of workspace in 0 seconds
[INFO] ------------------------------------------------------------------------
[INFO] BUILD SUCCESS
[INFO] ------------------------------------------------------------------------
[INFO] Total time: 26.853s
[INFO] Finished at: Wed Apr 11 19:17:37 CEST 2018
[INFO] Final Memory: 36M/528M
[INFO] ------------------------------------------------------------------------
Waiting for Jenkins to finish collecting data
Sending e-mails to: buildmaster@anotheria.net