FailedConsole Output

Started by an SCM change
Building in workspace /opt/app/jenkins/jenkins_home/jobs/moskito-webui_oncommit/workspace
 > git rev-parse --is-inside-work-tree # timeout=10
Fetching changes from the remote Git repository
 > git config remote.origin.url git@github.com:anotheria/moskito.git # timeout=10
Fetching upstream changes from git@github.com:anotheria/moskito.git
 > git --version # timeout=10
 > git fetch --tags --progress git@github.com:anotheria/moskito.git +refs/heads/*:refs/remotes/origin/*
 > git rev-parse origin/master^{commit} # timeout=10
Checking out Revision c50f1758c41d9ba357760a10afaa1aee17130695 (origin/master)
Commit message: "logging: logging aware producer interface"
 > git config core.sparsecheckout # timeout=10
 > git checkout -f c50f1758c41d9ba357760a10afaa1aee17130695
 > git rev-list b1642d4e3575c26fd91d7c19335991cd2b9417c1 # timeout=10
 > git tag -a -f -m Jenkins Build #1310 jenkins-moskito-webui_oncommit-1310 # timeout=10
Parsing POMs
Modules changed, recalculating dependency graph
Established TCP socket on 46475
[workspace] $ java -cp /opt/app/jenkins/jenkins_home/plugins/maven-plugin/WEB-INF/lib/maven3-agent-1.11.jar:/opt/app/jenkins/jenkins_home/tools/hudson.tasks.Maven_MavenInstallation/MAVEN305/boot/plexus-classworlds-2.4.jar org.jvnet.hudson.maven3.agent.Maven3Main /opt/app/jenkins/jenkins_home/tools/hudson.tasks.Maven_MavenInstallation/MAVEN305 /zeno/app/jenkins/apache-tomcat-8.5.14/webapps/jenkins/WEB-INF/lib/remoting-3.7.jar /opt/app/jenkins/jenkins_home/plugins/maven-plugin/WEB-INF/lib/maven3-interceptor-1.11.jar /opt/app/jenkins/jenkins_home/plugins/maven-plugin/WEB-INF/lib/maven3-interceptor-commons-1.11.jar 46475
<===[JENKINS REMOTING CAPACITY]===>channel started
Executing Maven:  -B -f /opt/app/jenkins/jenkins_home/jobs/moskito-webui_oncommit/workspace/pom.xml -U -e clean test install -pl moskito-webui -DBUILD_NUMBER=1310 -V
Apache Maven 3.0.5 (r01de14724cdef164cd33c7c8c2fe155faf9602da; 2013-02-19 14:51:28+0100)
Maven home: /zeno/app/jenkins/jenkins_home/tools/hudson.tasks.Maven_MavenInstallation/MAVEN305
Java version: 1.8.0_161, vendor: Oracle Corporation
Java home: /usr/lib/jvm/java-8-oracle/jre
Default locale: en_US, platform encoding: UTF-8
OS name: "linux", version: "4.4.0-116-generic", arch: "amd64", family: "unix"
[INFO] Error stacktraces are turned on.
[INFO] Scanning for projects...
Started calculate disk usage of build
Finished Calculation of disk usage of build in 0 seconds
Started calculate disk usage of workspace
Finished Calculation of disk usage of workspace in 0 seconds
Started calculate disk usage of build
Finished Calculation of disk usage of build in 0 seconds
Started calculate disk usage of workspace
Finished Calculation of disk usage of workspace in 0 seconds
Started calculate disk usage of build
Finished Calculation of disk usage of build in 0 seconds
Started calculate disk usage of workspace
Finished Calculation of disk usage of workspace in 0 seconds
Started calculate disk usage of build
Finished Calculation of disk usage of build in 0 seconds
Started calculate disk usage of workspace
Finished Calculation of disk usage of workspace in 0 seconds
Started calculate disk usage of build
Finished Calculation of disk usage of build in 0 seconds
Started calculate disk usage of workspace
Finished Calculation of disk usage of workspace in 0 seconds
Started calculate disk usage of build
Finished Calculation of disk usage of build in 0 seconds
Started calculate disk usage of workspace
Finished Calculation of disk usage of workspace in 0 seconds
Started calculate disk usage of build
Finished Calculation of disk usage of build in 0 seconds
Started calculate disk usage of workspace
Finished Calculation of disk usage of workspace in 0 seconds
Started calculate disk usage of build
Finished Calculation of disk usage of build in 0 seconds
Started calculate disk usage of workspace
Finished Calculation of disk usage of workspace in 0 seconds
Started calculate disk usage of build
Finished Calculation of disk usage of build in 0 seconds
Started calculate disk usage of workspace
Finished Calculation of disk usage of workspace in 0 seconds
Started calculate disk usage of build
Finished Calculation of disk usage of build in 0 seconds
Started calculate disk usage of workspace
Finished Calculation of disk usage of workspace in 0 seconds
Started calculate disk usage of build
Finished Calculation of disk usage of build in 0 seconds
Started calculate disk usage of workspace
Finished Calculation of disk usage of workspace in 0 seconds
Started calculate disk usage of build
Finished Calculation of disk usage of build in 0 seconds
Started calculate disk usage of workspace
Finished Calculation of disk usage of workspace in 0 seconds
Started calculate disk usage of build
Finished Calculation of disk usage of build in 0 seconds
Started calculate disk usage of workspace
Finished Calculation of disk usage of workspace in 0 seconds
Started calculate disk usage of build
Finished Calculation of disk usage of build in 0 seconds
Started calculate disk usage of workspace
Finished Calculation of disk usage of workspace in 0 seconds
Started calculate disk usage of build
Finished Calculation of disk usage of build in 0 seconds
Started calculate disk usage of workspace
Finished Calculation of disk usage of workspace in 0 seconds
Started calculate disk usage of build
Finished Calculation of disk usage of build in 0 seconds
Started calculate disk usage of workspace
Finished Calculation of disk usage of workspace in 0 seconds
Started calculate disk usage of build
Finished Calculation of disk usage of build in 0 seconds
Started calculate disk usage of workspace
Finished Calculation of disk usage of workspace in 0 seconds
Started calculate disk usage of build
Finished Calculation of disk usage of build in 0 seconds
Started calculate disk usage of workspace
Finished Calculation of disk usage of workspace in 0 seconds
Started calculate disk usage of build
Finished Calculation of disk usage of build in 0 seconds
Started calculate disk usage of workspace
Finished Calculation of disk usage of workspace in 0 seconds
Started calculate disk usage of build
Finished Calculation of disk usage of build in 0 seconds
Started calculate disk usage of workspace
Finished Calculation of disk usage of workspace in 0 seconds
Started calculate disk usage of build
Finished Calculation of disk usage of build in 0 seconds
Started calculate disk usage of workspace
Finished Calculation of disk usage of workspace in 0 seconds
Started calculate disk usage of build
Finished Calculation of disk usage of build in 0 seconds
Started calculate disk usage of workspace
Finished Calculation of disk usage of workspace in 0 seconds
[INFO]                                                                         
[INFO] ------------------------------------------------------------------------
[INFO] Building moskito embedded web user interface 2.9.2-SNAPSHOT
[INFO] ------------------------------------------------------------------------
Downloading: https://oss.sonatype.org/content/repositories/snapshots/net/anotheria/moskito-core/2.9.2-SNAPSHOT/maven-metadata.xml
Downloading: https://oss.sonatype.org/content/groups/public/net/anotheria/moskito-core/2.9.2-SNAPSHOT/maven-metadata.xml
Downloading: http://nexus.anotheria.net/nexus/content/groups/public/net/anotheria/moskito-core/2.9.2-SNAPSHOT/maven-metadata.xml
Downloaded: http://nexus.anotheria.net/nexus/content/groups/public/net/anotheria/moskito-core/2.9.2-SNAPSHOT/maven-metadata.xml (775 B at 2.1 KB/sec)
Downloaded: https://oss.sonatype.org/content/groups/public/net/anotheria/moskito-core/2.9.2-SNAPSHOT/maven-metadata.xml (775 B at 0.7 KB/sec)
Downloaded: https://oss.sonatype.org/content/repositories/snapshots/net/anotheria/moskito-core/2.9.2-SNAPSHOT/maven-metadata.xml (775 B at 0.7 KB/sec)
Downloading: http://nexus.anotheria.net/nexus/content/groups/public/net/anotheria/moskito-web/2.9.2-SNAPSHOT/maven-metadata.xml
Downloading: https://oss.sonatype.org/content/groups/public/net/anotheria/moskito-web/2.9.2-SNAPSHOT/maven-metadata.xml
Downloading: https://oss.sonatype.org/content/repositories/snapshots/net/anotheria/moskito-web/2.9.2-SNAPSHOT/maven-metadata.xml
Downloaded: http://nexus.anotheria.net/nexus/content/groups/public/net/anotheria/moskito-web/2.9.2-SNAPSHOT/maven-metadata.xml (774 B at 12.6 KB/sec)
Downloaded: https://oss.sonatype.org/content/groups/public/net/anotheria/moskito-web/2.9.2-SNAPSHOT/maven-metadata.xml (774 B at 2.2 KB/sec)
Downloaded: https://oss.sonatype.org/content/repositories/snapshots/net/anotheria/moskito-web/2.9.2-SNAPSHOT/maven-metadata.xml (774 B at 2.2 KB/sec)
[INFO] 
[INFO] --- maven-clean-plugin:2.4.1:clean (default-clean) @ moskito-webui ---
[INFO] Deleting /opt/app/jenkins/jenkins_home/jobs/moskito-webui_oncommit/workspace/moskito-webui/target
[INFO] 
[INFO] --- maven-enforcer-plugin:1.0:enforce (enforce-maven) @ moskito-webui ---
[INFO] 
[INFO] --- maven-resources-plugin:2.5:resources (default-resources) @ moskito-webui ---
[debug] execute contextualize
[INFO] Using 'UTF-8' encoding to copy filtered resources.
[INFO] Copying 194 resources
[INFO] Copying 63 resources
[INFO] 
[INFO] --- maven-compiler-plugin:3.5.1:compile (default-compile) @ moskito-webui ---
[INFO] Changes detected - recompiling the module!
[INFO] Compiling 264 source files to /opt/app/jenkins/jenkins_home/jobs/moskito-webui_oncommit/workspace/moskito-webui/target/classes
[INFO] -------------------------------------------------------------
[ERROR] COMPILATION ERROR : 
[INFO] -------------------------------------------------------------
[ERROR] /opt/app/jenkins/jenkins_home/jobs/moskito-webui_oncommit/workspace/moskito-webui/src/main/java/net/anotheria/moskito/webui/producers/api/ProducerAPIImpl.java:[12,44] cannot find symbol
  symbol:   class LoggingAwareProducer
  location: package net.anotheria.moskito.core.producers
[ERROR] /opt/app/jenkins/jenkins_home/jobs/moskito-webui_oncommit/workspace/moskito-webui/src/main/java/net/anotheria/moskito/webui/producers/api/ProducerAPIImpl.java:[332,17] cannot find symbol
  symbol:   class LoggingAwareProducer
  location: class net.anotheria.moskito.webui.producers.api.ProducerAPIImpl
[INFO] 2 errors 
[INFO] -------------------------------------------------------------
Started calculate disk usage of build
Finished Calculation of disk usage of build in 0 seconds
Started calculate disk usage of workspace
Finished Calculation of disk usage of workspace in 0 seconds
[INFO] ------------------------------------------------------------------------
[INFO] BUILD FAILURE
[INFO] ------------------------------------------------------------------------
[INFO] Total time: 1:47.229s
[INFO] Finished at: Tue Sep 17 16:12:27 CEST 2019
[INFO] Final Memory: 29M/298M
[INFO] ------------------------------------------------------------------------
Waiting for Jenkins to finish collecting data
[ERROR] Failed to execute goal org.apache.maven.plugins:maven-compiler-plugin:3.5.1:compile (default-compile) on project moskito-webui: Compilation failure: Compilation failure:
[ERROR] /opt/app/jenkins/jenkins_home/jobs/moskito-webui_oncommit/workspace/moskito-webui/src/main/java/net/anotheria/moskito/webui/producers/api/ProducerAPIImpl.java:[12,44] cannot find symbol
[ERROR] symbol:   class LoggingAwareProducer
[ERROR] location: package net.anotheria.moskito.core.producers
[ERROR] /opt/app/jenkins/jenkins_home/jobs/moskito-webui_oncommit/workspace/moskito-webui/src/main/java/net/anotheria/moskito/webui/producers/api/ProducerAPIImpl.java:[332,17] cannot find symbol
[ERROR] symbol:   class LoggingAwareProducer
[ERROR] location: class net.anotheria.moskito.webui.producers.api.ProducerAPIImpl
[ERROR] -> [Help 1]
org.apache.maven.lifecycle.LifecycleExecutionException: Failed to execute goal org.apache.maven.plugins:maven-compiler-plugin:3.5.1:compile (default-compile) on project moskito-webui: Compilation failure
	at org.apache.maven.lifecycle.internal.MojoExecutor.execute(MojoExecutor.java:213)
	at org.apache.maven.lifecycle.internal.MojoExecutor.execute(MojoExecutor.java:153)
	at org.apache.maven.lifecycle.internal.MojoExecutor.execute(MojoExecutor.java:145)
	at org.apache.maven.lifecycle.internal.LifecycleModuleBuilder.buildProject(LifecycleModuleBuilder.java:84)
	at org.apache.maven.lifecycle.internal.LifecycleModuleBuilder.buildProject(LifecycleModuleBuilder.java:59)
	at org.apache.maven.lifecycle.internal.LifecycleStarter.singleThreadedBuild(LifecycleStarter.java:183)
	at org.apache.maven.lifecycle.internal.LifecycleStarter.execute(LifecycleStarter.java:161)
	at org.apache.maven.DefaultMaven.doExecute(DefaultMaven.java:320)
	at org.apache.maven.DefaultMaven.execute(DefaultMaven.java:156)
	at org.jvnet.hudson.maven3.launcher.Maven3Launcher.main(Maven3Launcher.java:117)
	at sun.reflect.NativeMethodAccessorImpl.invoke0(Native Method)
	at sun.reflect.NativeMethodAccessorImpl.invoke(NativeMethodAccessorImpl.java:62)
	at sun.reflect.DelegatingMethodAccessorImpl.invoke(DelegatingMethodAccessorImpl.java:43)
	at java.lang.reflect.Method.invoke(Method.java:498)
	at org.codehaus.plexus.classworlds.launcher.Launcher.launchStandard(Launcher.java:329)
	at org.codehaus.plexus.classworlds.launcher.Launcher.launch(Launcher.java:239)
	at org.jvnet.hudson.maven3.agent.Maven3Main.launch(Maven3Main.java:181)
	at sun.reflect.NativeMethodAccessorImpl.invoke0(Native Method)
	at sun.reflect.NativeMethodAccessorImpl.invoke(NativeMethodAccessorImpl.java:62)
	at sun.reflect.DelegatingMethodAccessorImpl.invoke(DelegatingMethodAccessorImpl.java:43)
	at java.lang.reflect.Method.invoke(Method.java:498)
	at hudson.maven.Maven3Builder.call(Maven3Builder.java:139)
	at hudson.maven.Maven3Builder.call(Maven3Builder.java:70)
	at hudson.remoting.UserRequest.perform(UserRequest.java:153)
	at hudson.remoting.UserRequest.perform(UserRequest.java:50)
	at hudson.remoting.Request$2.run(Request.java:336)
	at hudson.remoting.InterceptingExecutorService$1.call(InterceptingExecutorService.java:68)
	at java.util.concurrent.FutureTask.run(FutureTask.java:266)
	at java.util.concurrent.ThreadPoolExecutor.runWorker(ThreadPoolExecutor.java:1149)
	at java.util.concurrent.ThreadPoolExecutor$Worker.run(ThreadPoolExecutor.java:624)
	at java.lang.Thread.run(Thread.java:748)
Caused by: org.apache.maven.plugin.compiler.CompilationFailureException: Compilation failure
	at org.apache.maven.plugin.compiler.AbstractCompilerMojo.execute(AbstractCompilerMojo.java:972)
	at org.apache.maven.plugin.compiler.CompilerMojo.execute(CompilerMojo.java:129)
	at org.apache.maven.plugin.DefaultBuildPluginManager.executeMojo(DefaultBuildPluginManager.java:101)
	at org.apache.maven.lifecycle.internal.MojoExecutor.execute(MojoExecutor.java:209)
	... 30 more
[ERROR] 
[ERROR] Re-run Maven using the -X switch to enable full debug logging.
[ERROR] 
[ERROR] For more information about the errors and possible solutions, please read the following articles:
[ERROR] [Help 1] http://cwiki.apache.org/confluence/display/MAVEN/MojoFailureException
[JENKINS] Archiving /opt/app/jenkins/jenkins_home/jobs/moskito-webui_oncommit/workspace/moskito-webui/pom.xml to net.anotheria/moskito-webui/2.9.2-SNAPSHOT/moskito-webui-2.9.2-SNAPSHOT.pom
Sending e-mails to: buildmaster@anotheria.net
channel stopped
Started calculate disk usage of build
Finished Calculation of disk usage of build in 0 seconds
Started calculate disk usage of workspace
Finished Calculation of disk usage of workspace in 0 seconds
Sending e-mails to: buildmaster@anotheria.net
Finished: FAILURE