FailedConsole Output

Started by an SCM change
Building in workspace /opt/app/jenkins/jenkins_home/jobs/moskito-webui_oncommit/workspace
 > git rev-parse --is-inside-work-tree # timeout=10
Fetching changes from the remote Git repository
 > git config remote.origin.url git@github.com:anotheria/moskito.git # timeout=10
Fetching upstream changes from git@github.com:anotheria/moskito.git
 > git --version # timeout=10
 > git fetch --tags --progress git@github.com:anotheria/moskito.git +refs/heads/*:refs/remotes/origin/*
 > git rev-parse origin/master^{commit} # timeout=10
Checking out Revision 4b34133f00195e7342614a77985189abab558514 (origin/master)
Commit message: "[maven-release-plugin] prepare for next development iteration"
 > git config core.sparsecheckout # timeout=10
 > git checkout -f 4b34133f00195e7342614a77985189abab558514
 > git rev-list 06c14460dc6bc718338ac5e907bc9b9a7d7c7919 # timeout=10
 > git tag -a -f -m Jenkins Build #1316 jenkins-moskito-webui_oncommit-1316 # timeout=10
Parsing POMs
Modules changed, recalculating dependency graph
Established TCP socket on 44252
[workspace] $ java -cp /opt/app/jenkins/jenkins_home/plugins/maven-plugin/WEB-INF/lib/maven3-agent-1.11.jar:/opt/app/jenkins/jenkins_home/tools/hudson.tasks.Maven_MavenInstallation/MAVEN305/boot/plexus-classworlds-2.4.jar org.jvnet.hudson.maven3.agent.Maven3Main /opt/app/jenkins/jenkins_home/tools/hudson.tasks.Maven_MavenInstallation/MAVEN305 /zeno/app/jenkins/apache-tomcat-8.5.14/webapps/jenkins/WEB-INF/lib/remoting-3.7.jar /opt/app/jenkins/jenkins_home/plugins/maven-plugin/WEB-INF/lib/maven3-interceptor-1.11.jar /opt/app/jenkins/jenkins_home/plugins/maven-plugin/WEB-INF/lib/maven3-interceptor-commons-1.11.jar 44252
<===[JENKINS REMOTING CAPACITY]===>channel started
Executing Maven:  -B -f /opt/app/jenkins/jenkins_home/jobs/moskito-webui_oncommit/workspace/pom.xml -U -e clean test install -pl moskito-webui -DBUILD_NUMBER=1316 -V
Apache Maven 3.0.5 (r01de14724cdef164cd33c7c8c2fe155faf9602da; 2013-02-19 14:51:28+0100)
Maven home: /zeno/app/jenkins/jenkins_home/tools/hudson.tasks.Maven_MavenInstallation/MAVEN305
Java version: 1.8.0_161, vendor: Oracle Corporation
Java home: /usr/lib/jvm/java-8-oracle/jre
Default locale: en_US, platform encoding: UTF-8
OS name: "linux", version: "4.4.0-116-generic", arch: "amd64", family: "unix"
[INFO] Error stacktraces are turned on.
[INFO] Scanning for projects...
Started calculate disk usage of build
Finished Calculation of disk usage of build in 0 seconds
Started calculate disk usage of workspace
Finished Calculation of disk usage of workspace in 0 seconds
Started calculate disk usage of build
Finished Calculation of disk usage of build in 0 seconds
Started calculate disk usage of workspace
Finished Calculation of disk usage of workspace in 0 seconds
Started calculate disk usage of build
Finished Calculation of disk usage of build in 0 seconds
Started calculate disk usage of workspace
Finished Calculation of disk usage of workspace in 0 seconds
Started calculate disk usage of build
Finished Calculation of disk usage of build in 0 seconds
Started calculate disk usage of workspace
Finished Calculation of disk usage of workspace in 0 seconds
Started calculate disk usage of build
Finished Calculation of disk usage of build in 0 seconds
Started calculate disk usage of workspace
Finished Calculation of disk usage of workspace in 0 seconds
Started calculate disk usage of build
Finished Calculation of disk usage of build in 0 seconds
Started calculate disk usage of workspace
Finished Calculation of disk usage of workspace in 0 seconds
Started calculate disk usage of build
Finished Calculation of disk usage of build in 0 seconds
Started calculate disk usage of workspace
Finished Calculation of disk usage of workspace in 0 seconds
Started calculate disk usage of build
Finished Calculation of disk usage of build in 0 seconds
Started calculate disk usage of workspace
Finished Calculation of disk usage of workspace in 0 seconds
Started calculate disk usage of build
Finished Calculation of disk usage of build in 0 seconds
Started calculate disk usage of workspace
Finished Calculation of disk usage of workspace in 0 seconds
Started calculate disk usage of build
Finished Calculation of disk usage of build in 0 seconds
Started calculate disk usage of workspace
Finished Calculation of disk usage of workspace in 0 seconds
Started calculate disk usage of build
Finished Calculation of disk usage of build in 0 seconds
Started calculate disk usage of workspace
Finished Calculation of disk usage of workspace in 0 seconds
Started calculate disk usage of build
Finished Calculation of disk usage of build in 0 seconds
Started calculate disk usage of workspace
Finished Calculation of disk usage of workspace in 0 seconds
Started calculate disk usage of build
Finished Calculation of disk usage of build in 0 seconds
Started calculate disk usage of workspace
Finished Calculation of disk usage of workspace in 0 seconds
Started calculate disk usage of build
Finished Calculation of disk usage of build in 0 seconds
Started calculate disk usage of workspace
Finished Calculation of disk usage of workspace in 0 seconds
Started calculate disk usage of build
Finished Calculation of disk usage of build in 0 seconds
Started calculate disk usage of workspace
Finished Calculation of disk usage of workspace in 0 seconds
Started calculate disk usage of build
Finished Calculation of disk usage of build in 0 seconds
Started calculate disk usage of workspace
Finished Calculation of disk usage of workspace in 0 seconds
Started calculate disk usage of build
Finished Calculation of disk usage of build in 0 seconds
Started calculate disk usage of workspace
Finished Calculation of disk usage of workspace in 0 seconds
Started calculate disk usage of build
Finished Calculation of disk usage of build in 0 seconds
Started calculate disk usage of workspace
Finished Calculation of disk usage of workspace in 0 seconds
Started calculate disk usage of build
Finished Calculation of disk usage of build in 0 seconds
Started calculate disk usage of workspace
Finished Calculation of disk usage of workspace in 0 seconds
Started calculate disk usage of build
Finished Calculation of disk usage of build in 0 seconds
Started calculate disk usage of workspace
Finished Calculation of disk usage of workspace in 0 seconds
Started calculate disk usage of build
Finished Calculation of disk usage of build in 0 seconds
Started calculate disk usage of workspace
Finished Calculation of disk usage of workspace in 0 seconds
Started calculate disk usage of build
Finished Calculation of disk usage of build in 0 seconds
Started calculate disk usage of workspace
Finished Calculation of disk usage of workspace in 0 seconds
Started calculate disk usage of build
Finished Calculation of disk usage of build in 0 seconds
Started calculate disk usage of workspace
Finished Calculation of disk usage of workspace in 0 seconds
[INFO]                                                                         
[INFO] ------------------------------------------------------------------------
[INFO] Building moskito embedded web user interface 2.9.3-SNAPSHOT
[INFO] ------------------------------------------------------------------------
Downloading: http://nexus.anotheria.net/nexus/content/groups/public/net/anotheria/moskito-core/2.9.3-SNAPSHOT/maven-metadata.xml
Downloading: https://oss.sonatype.org/content/groups/public/net/anotheria/moskito-core/2.9.3-SNAPSHOT/maven-metadata.xml
Downloading: https://oss.sonatype.org/content/repositories/snapshots/net/anotheria/moskito-core/2.9.3-SNAPSHOT/maven-metadata.xml
Downloading: http://nexus.anotheria.net/nexus/content/groups/public/net/anotheria/moskito-web/2.9.3-SNAPSHOT/maven-metadata.xml
Downloading: https://oss.sonatype.org/content/groups/public/net/anotheria/moskito-web/2.9.3-SNAPSHOT/maven-metadata.xml
Downloading: https://oss.sonatype.org/content/repositories/snapshots/net/anotheria/moskito-web/2.9.3-SNAPSHOT/maven-metadata.xml
Downloading: http://nexus.anotheria.net/nexus/content/groups/public/net/anotheria/moskito-core/2.9.3-SNAPSHOT/moskito-core-2.9.3-SNAPSHOT.jar
Downloading: http://nexus.anotheria.net/nexus/content/groups/public/net/anotheria/moskito-web/2.9.3-SNAPSHOT/moskito-web-2.9.3-SNAPSHOT.jar
Downloading: https://oss.sonatype.org/content/groups/public/net/anotheria/moskito-core/2.9.3-SNAPSHOT/moskito-core-2.9.3-SNAPSHOT.jar
Downloading: https://oss.sonatype.org/content/groups/public/net/anotheria/moskito-web/2.9.3-SNAPSHOT/moskito-web-2.9.3-SNAPSHOT.jar
Downloading: https://oss.sonatype.org/content/repositories/snapshots/net/anotheria/moskito-core/2.9.3-SNAPSHOT/moskito-core-2.9.3-SNAPSHOT.jar
Downloading: https://oss.sonatype.org/content/repositories/snapshots/net/anotheria/moskito-web/2.9.3-SNAPSHOT/moskito-web-2.9.3-SNAPSHOT.jar
Started calculate disk usage of build
Finished Calculation of disk usage of build in 0 seconds
Started calculate disk usage of workspace
Finished Calculation of disk usage of workspace in 0 seconds
[INFO] ------------------------------------------------------------------------
[INFO] BUILD FAILURE
[INFO] ------------------------------------------------------------------------
[INFO] Total time: 14.752s
[INFO] Finished at: Tue Dec 03 23:25:43 CET 2019
[INFO] Final Memory: 17M/273M
[INFO] ------------------------------------------------------------------------
Waiting for Jenkins to finish collecting data
[ERROR] Failed to execute goal on project moskito-webui: Could not resolve dependencies for project net.anotheria:moskito-webui:jar:2.9.3-SNAPSHOT: The following artifacts could not be resolved: net.anotheria:moskito-core:jar:2.9.3-SNAPSHOT, net.anotheria:moskito-web:jar:2.9.3-SNAPSHOT: Could not find artifact net.anotheria:moskito-core:jar:2.9.3-SNAPSHOT in provided (http://nexus.anotheria.net/nexus/content/groups/public) -> [Help 1]
org.apache.maven.lifecycle.LifecycleExecutionException: Failed to execute goal on project moskito-webui: Could not resolve dependencies for project net.anotheria:moskito-webui:jar:2.9.3-SNAPSHOT: The following artifacts could not be resolved: net.anotheria:moskito-core:jar:2.9.3-SNAPSHOT, net.anotheria:moskito-web:jar:2.9.3-SNAPSHOT: Could not find artifact net.anotheria:moskito-core:jar:2.9.3-SNAPSHOT in provided (http://nexus.anotheria.net/nexus/content/groups/public)
	at org.apache.maven.lifecycle.internal.LifecycleDependencyResolver.getDependencies(LifecycleDependencyResolver.java:210)
	at org.apache.maven.lifecycle.internal.LifecycleDependencyResolver.resolveProjectDependencies(LifecycleDependencyResolver.java:117)
	at org.apache.maven.lifecycle.internal.MojoExecutor.ensureDependenciesAreResolved(MojoExecutor.java:258)
	at org.apache.maven.lifecycle.internal.MojoExecutor.execute(MojoExecutor.java:201)
	at org.apache.maven.lifecycle.internal.MojoExecutor.execute(MojoExecutor.java:153)
	at org.apache.maven.lifecycle.internal.MojoExecutor.execute(MojoExecutor.java:145)
	at org.apache.maven.lifecycle.internal.LifecycleModuleBuilder.buildProject(LifecycleModuleBuilder.java:84)
	at org.apache.maven.lifecycle.internal.LifecycleModuleBuilder.buildProject(LifecycleModuleBuilder.java:59)
	at org.apache.maven.lifecycle.internal.LifecycleStarter.singleThreadedBuild(LifecycleStarter.java:183)
	at org.apache.maven.lifecycle.internal.LifecycleStarter.execute(LifecycleStarter.java:161)
	at org.apache.maven.DefaultMaven.doExecute(DefaultMaven.java:320)
	at org.apache.maven.DefaultMaven.execute(DefaultMaven.java:156)
	at org.jvnet.hudson.maven3.launcher.Maven3Launcher.main(Maven3Launcher.java:117)
	at sun.reflect.NativeMethodAccessorImpl.invoke0(Native Method)
	at sun.reflect.NativeMethodAccessorImpl.invoke(NativeMethodAccessorImpl.java:62)
	at sun.reflect.DelegatingMethodAccessorImpl.invoke(DelegatingMethodAccessorImpl.java:43)
	at java.lang.reflect.Method.invoke(Method.java:498)
	at org.codehaus.plexus.classworlds.launcher.Launcher.launchStandard(Launcher.java:329)
	at org.codehaus.plexus.classworlds.launcher.Launcher.launch(Launcher.java:239)
	at org.jvnet.hudson.maven3.agent.Maven3Main.launch(Maven3Main.java:181)
	at sun.reflect.NativeMethodAccessorImpl.invoke0(Native Method)
	at sun.reflect.NativeMethodAccessorImpl.invoke(NativeMethodAccessorImpl.java:62)
	at sun.reflect.DelegatingMethodAccessorImpl.invoke(DelegatingMethodAccessorImpl.java:43)
	at java.lang.reflect.Method.invoke(Method.java:498)
	at hudson.maven.Maven3Builder.call(Maven3Builder.java:139)
	at hudson.maven.Maven3Builder.call(Maven3Builder.java:70)
	at hudson.remoting.UserRequest.perform(UserRequest.java:153)
	at hudson.remoting.UserRequest.perform(UserRequest.java:50)
	at hudson.remoting.Request$2.run(Request.java:336)
	at hudson.remoting.InterceptingExecutorService$1.call(InterceptingExecutorService.java:68)
	at java.util.concurrent.FutureTask.run(FutureTask.java:266)
	at java.util.concurrent.ThreadPoolExecutor.runWorker(ThreadPoolExecutor.java:1149)
	at java.util.concurrent.ThreadPoolExecutor$Worker.run(ThreadPoolExecutor.java:624)
	at java.lang.Thread.run(Thread.java:748)
Caused by: org.apache.maven.project.DependencyResolutionException: Could not resolve dependencies for project net.anotheria:moskito-webui:jar:2.9.3-SNAPSHOT: The following artifacts could not be resolved: net.anotheria:moskito-core:jar:2.9.3-SNAPSHOT, net.anotheria:moskito-web:jar:2.9.3-SNAPSHOT: Could not find artifact net.anotheria:moskito-core:jar:2.9.3-SNAPSHOT in provided (http://nexus.anotheria.net/nexus/content/groups/public)
	at org.apache.maven.project.DefaultProjectDependenciesResolver.resolve(DefaultProjectDependenciesResolver.java:189)
	at org.apache.maven.lifecycle.internal.LifecycleDependencyResolver.getDependencies(LifecycleDependencyResolver.java:185)
	... 33 more
Caused by: org.sonatype.aether.resolution.DependencyResolutionException: The following artifacts could not be resolved: net.anotheria:moskito-core:jar:2.9.3-SNAPSHOT, net.anotheria:moskito-web:jar:2.9.3-SNAPSHOT: Could not find artifact net.anotheria:moskito-core:jar:2.9.3-SNAPSHOT in provided (http://nexus.anotheria.net/nexus/content/groups/public)
	at org.sonatype.aether.impl.internal.DefaultRepositorySystem.resolveDependencies(DefaultRepositorySystem.java:375)
	at org.apache.maven.project.DefaultProjectDependenciesResolver.resolve(DefaultProjectDependenciesResolver.java:183)
	... 34 more
Caused by: org.sonatype.aether.resolution.ArtifactResolutionException: The following artifacts could not be resolved: net.anotheria:moskito-core:jar:2.9.3-SNAPSHOT, net.anotheria:moskito-web:jar:2.9.3-SNAPSHOT: Could not find artifact net.anotheria:moskito-core:jar:2.9.3-SNAPSHOT in provided (http://nexus.anotheria.net/nexus/content/groups/public)
	at org.sonatype.aether.impl.internal.DefaultArtifactResolver.resolve(DefaultArtifactResolver.java:538)
	at org.sonatype.aether.impl.internal.DefaultArtifactResolver.resolveArtifacts(DefaultArtifactResolver.java:216)
	at org.sonatype.aether.impl.internal.DefaultRepositorySystem.resolveDependencies(DefaultRepositorySystem.java:358)
	... 35 more
Caused by: org.sonatype.aether.transfer.ArtifactNotFoundException: Could not find artifact net.anotheria:moskito-core:jar:2.9.3-SNAPSHOT in provided (http://nexus.anotheria.net/nexus/content/groups/public)
	at org.sonatype.aether.connector.wagon.WagonRepositoryConnector$4.wrap(WagonRepositoryConnector.java:947)
	at org.sonatype.aether.connector.wagon.WagonRepositoryConnector$4.wrap(WagonRepositoryConnector.java:941)
	at org.sonatype.aether.connector.wagon.WagonRepositoryConnector$GetTask.run(WagonRepositoryConnector.java:669)
	at org.sonatype.aether.util.concurrency.RunnableErrorForwarder$1.run(RunnableErrorForwarder.java:60)
	... 3 more
[ERROR] 
[ERROR] Re-run Maven using the -X switch to enable full debug logging.
[ERROR] 
[ERROR] For more information about the errors and possible solutions, please read the following articles:
[ERROR] [Help 1] http://cwiki.apache.org/confluence/display/MAVEN/DependencyResolutionException
[JENKINS] Archiving /opt/app/jenkins/jenkins_home/jobs/moskito-webui_oncommit/workspace/moskito-webui/pom.xml to net.anotheria/moskito-webui/2.9.3-SNAPSHOT/moskito-webui-2.9.3-SNAPSHOT.pom
Sending e-mails to: buildmaster@anotheria.net
channel stopped
Started calculate disk usage of build
Finished Calculation of disk usage of build in 0 seconds
Started calculate disk usage of workspace
Finished Calculation of disk usage of workspace in 0 seconds
Sending e-mails to: buildmaster@anotheria.net
Finished: FAILURE